{"text_format":"1","workbook":"xlsx","n_sheets":12,"sheets":["Input Uni-Lateral","Input Uni-Lateral (2)","Input Sheet","Input Bilateral","Initial_Rep","Progress_1_Rep","Progress_2_Rep ","Discharge_Rep","Patient Initial Dashboard","Reporting Initial","Patient  Progress 1 Dashboard","Dropdown"],"not_rendered":{"charts":35,"images":2,"macros":0,"external_links":0,"defined_names":0,"comments":4,"pivot_tables":0},"unopened":[],"bounds":{"document_bytes":16777216,"sheet_cells":100000,"rows_first":2000,"rows_last":500,"rows_between":2000,"halvings":0,"cell_chars":16384,"cell_head_chars":4096},"cells_cut":0,"cells_raw":0,"read":"whole","date_system":"1900"}

{"sheet":"Input Uni-Lateral","index":0,"n_rows":118,"n_cols":58,"rows_kept":118,"cut":false,"hidden":true,"merged":[[74,0,75,0],[76,0,77,0],[78,0,79,0],[80,0,81,0],[82,0,83,0],[48,55,49,55],[46,55,47,55],[44,55,45,55],[42,55,43,55],[66,55,67,55],[64,55,65,55],[62,55,63,55],[60,55,61,55],[58,55,59,55],[56,55,57,55],[54,55,55,55],[52,55,53,55],[50,55,51,55],[56,36,57,36],[52,36,53,36],[50,36,51,36],[48,36,49,36],[54,36,55,36],[54,51,55,51],[40,55,41,55],[38,55,39,55],[46,17,47,17],[44,17,45,17],[42,17,43,17],[40,17,41,17],[38,17,39,17],[38,36,39,36],[42,36,43,36],[40,36,41,36],[44,21,45,21],[44,22,45,22],[44,23,45,23],[46,19,47,19],[44,19,45,19],[42,19,43,19],[40,19,41,19],[42,21,43,21],[42,22,43,22],[42,23,43,23],[46,36,47,36],[44,36,45,36],[44,18,45,18],[46,18,47,18],[38,11,39,11],[54,37,55,37],[38,19,39,19],[40,13,41,13],[42,13,43,13],[44,13,45,13],[46,13,47,13],[44,32,45,32],[46,21,47,21],[46,22,47,22],[46,23,47,23],[46,25,47,25],[46,26,47,26],[46,27,47,27],[46,28,47,28],[46,29,47,29],[46,30,47,30],[52,26,53,26],[50,21,51,21],[50,22,51,22],[50,23,51,23],[50,25,51,25],[50,26,51,26],[42,18,43,18],[44,56,45,56],[46,56,47,56],[42,56,43,56],[40,56,41,56],[38,56,39,56],[66,57,67,57],[64,57,65,57],[62,57,63,57],[60,57,61,57],[58,57,59,57],[56,57,57,57],[54,57,55,57],[50,57,51,57],[52,57,53,57],[48,57,49,57],[46,57,47,57],[44,57,45,57],[42,57,43,57],[40,57,41,57],[38,57,39,57],[66,56,67,56],[64,56,65,56],[62,56,63,56],[60,56,61,56],[58,56,59,56],[56,56,57,56],[54,56,55,56],[52,56,53,56],[50,56,51,56],[38,38,39,38],[56,37,57,37],[52,37,53,37],[50,37,51,37],[48,37,49,37],[46,37,47,37],[44,37,45,37],[42,37,43,37],[40,37,41,37],[56,38,57,38],[54,38,55,38],[52,38,53,38],[50,38,51,38],[48,38,49,38],[46,38,47,38],[44,38,45,38],[42,38,43,38],[48,56,49,56],[38,37,39,37],[56,51,57,51],[58,51,59,51],[60,51,61,51],[62,51,63,51],[64,51,65,51],[62,40,63,40],[62,41,63,41],[62,42,63,42],[62,44,63,44],[62,45,63,45],[62,46,63,46],[62,47,63,47],[62,48,63,48],[62,49,63,49],[58,42,59,42],[58,44,59,44],[58,45,59,45],[58,46,59,46],[58,47,59,47],[58,48,59,48],[58,49,59,49],[60,40,61,40],[60,41,61,41],[60,42,61,42],[66,51,67,51],[56,32,57,32],[37,52,37,56],[38,51,39,51],[40,51,41,51],[42,51,43,51],[44,51,45,51],[46,51,47,51],[48,51,49,51],[50,51,51,51],[52,51,53,51],[36,32,37,32],[48,32,49,32],[50,32,51,32],[52,32,53,32],[54,32,55,32],[66,40,67,40],[66,41,67,41],[66,42,67,42],[66,44,67,44],[66,45,67,45],[66,46,67,46],[66,47,67,47],[40,38,41,38],[68,40,69,40],[68,41,69,41],[68,42,69,42],[68,44,69,44],[68,45,69,45],[68,46,69,46],[68,47,69,47],[68,48,69,48],[68,49,69,49],[66,48,67,48],[66,49,67,49],[64,40,65,40],[64,41,65,41],[64,42,65,42],[64,44,65,44],[64,45,65,45],[64,46,65,46],[64,47,65,47],[64,48,65,48],[64,49,65,49],[60,44,61,44],[60,45,61,45],[60,46,61,46],[60,47,61,47],[60,48,61,48],[60,49,61,49],[58,40,59,40],[58,41,59,41],[52,28,53,28],[52,29,53,29],[52,30,53,30],[56,40,57,40],[56,41,57,41],[56,42,57,42],[54,49,55,49],[52,49,53,49],[56,49,57,49],[54,40,55,40],[56,44,57,44],[56,45,57,45],[56,46,57,46],[48,18,49,18],[50,18,51,18],[52,18,53,18],[54,18,55,18],[56,18,57,18],[70,22,90,23],[31,0,32,20],[31,21,32,39],[36,30,37,30],[36,29,37,29],[36,28,37,28],[36,27,37,27],[36,26,37,26],[36,25,37,25],[36,23,37,23],[36,21,37,22],[35,2,35,12],[36,2,37,3],[36,4,37,4],[36,6,37,6],[36,7,37,7],[36,8,37,8],[36,9,37,9],[36,10,37,10],[36,11,37,11],[36,33,37,38],[35,20,57,20],[35,39,57,39],[38,18,39,18],[40,18,41,18],[56,29,57,29],[56,30,57,30],[54,29,55,29],[54,30,55,30],[38,13,39,13],[52,21,53,21],[52,22,53,22],[52,23,53,23],[52,25,53,25],[52,27,53,27],[54,28,55,28],[56,28,57,28],[56,21,57,21],[56,22,57,22],[56,23,57,23],[56,25,57,25],[56,26,57,26],[56,27,57,27],[50,27,51,27],[50,28,51,28],[50,29,51,29],[50,30,51,30],[48,21,49,21],[48,22,49,22],[48,23,49,23],[48,25,49,25],[48,26,49,26],[48,27,49,27],[48,28,49,28],[48,29,49,29],[48,30,49,30],[37,14,37,18],[46,32,47,32],[38,32,39,32],[40,32,41,32],[42,32,43,32],[46,40,47,40],[46,41,47,41],[42,40,43,40],[42,41,43,41],[36,40,37,41],[44,25,45,25],[44,26,45,26],[44,27,45,27],[44,28,45,28],[44,29,45,29],[44,30,45,30],[42,25,43,25],[42,26,43,26],[42,27,43,27],[42,28,43,28],[42,29,43,29],[42,30,43,30],[40,21,41,21],[40,22,41,22],[54,21,55,21],[54,22,55,22],[54,23,55,23],[54,25,55,25],[54,26,55,26],[54,27,55,27],[50,42,51,42],[56,47,57,47],[56,48,57,48],[52,40,53,40],[52,41,53,41],[52,42,53,42],[52,44,53,44],[52,45,53,45],[52,46,53,46],[52,47,53,47],[52,48,53,48],[54,41,55,41],[54,42,55,42],[54,44,55,44],[54,45,55,45],[54,46,55,46],[54,47,55,47],[54,48,55,48],[50,44,51,44],[50,45,51,45],[50,46,51,46],[50,47,51,47],[50,48,51,48],[50,49,51,49],[48,40,49,40],[48,41,49,41],[48,42,49,42],[48,44,49,44],[48,45,49,45],[48,46,49,46],[48,47,49,47],[48,48,49,48],[48,49,49,49],[50,40,51,40],[50,41,51,41],[46,42,47,42],[46,44,47,44],[46,45,47,45],[46,46,47,46],[46,47,47,47],[46,48,47,48],[46,49,47,49],[44,40,45,40],[44,41,45,41],[44,42,45,42],[44,44,45,44],[44,45,45,45],[44,46,45,46],[44,47,45,47],[44,48,45,48],[44,49,45,49],[42,42,43,42],[42,44,43,44],[42,45,43,45],[42,46,43,46],[42,47,43,47],[42,48,43,48],[42,49,43,49],[40,40,41,40],[40,41,41,41],[40,42,41,42],[40,44,41,44],[40,45,41,45],[40,46,41,46],[40,47,41,47],[40,48,41,48],[40,49,41,49],[36,42,37,42],[36,44,37,44],[36,45,37,45],[36,46,37,46],[36,47,37,47],[36,48,37,48],[36,49,37,49],[38,40,39,40],[38,41,39,41],[38,42,39,42],[38,44,39,44],[38,45,39,45],[38,46,39,46],[38,47,39,47],[38,48,39,48],[38,49,39,49],[40,23,41,23],[40,25,41,25],[40,26,41,26],[40,27,41,27],[40,28,41,28],[40,29,41,29],[40,30,41,30],[38,21,39,21],[38,22,39,22],[38,23,39,23],[38,25,39,25],[38,26,39,26],[38,27,39,27],[38,28,39,28],[38,29,39,29],[38,30,39,30],[35,0,59,1],[27,0,28,12],[92,24,93,24],[92,25,93,25],[92,26,93,26],[88,24,89,24],[88,25,89,25],[88,26,89,26],[84,24,85,24],[84,25,85,25],[84,26,85,26],[80,24,81,24],[80,25,81,25],[80,26,81,26],[71,24,71,37],[72,24,73,25],[72,26,73,26],[92,31,93,31],[92,33,93,33],[92,35,93,35],[90,24,91,24],[90,25,91,25],[90,26,91,26],[90,28,91,28],[90,29,91,29],[90,31,91,31],[90,33,91,33],[90,35,91,35],[92,30,93,30],[90,30,91,30],[92,28,93,28],[92,29,93,29],[88,31,89,31],[88,33,89,33],[88,35,89,35],[86,24,87,24],[86,25,87,25],[86,26,87,26],[86,28,87,28],[86,29,87,29],[86,31,87,31],[86,33,87,33],[86,35,87,35],[88,30,89,30],[86,30,87,30],[88,28,89,28],[88,29,89,29],[84,31,85,31],[84,33,85,33],[84,35,85,35],[82,24,83,24],[82,25,83,25],[82,26,83,26],[82,28,83,28],[82,29,83,29],[82,31,83,31],[82,33,83,33],[82,35,83,35],[84,30,85,30],[82,30,83,30],[84,28,85,28],[84,29,85,29],[80,31,81,31],[80,33,81,33],[80,35,81,35],[76,29,77,29],[76,31,77,31],[76,33,77,33],[76,35,77,35],[78,24,79,24],[78,25,79,25],[78,26,79,26],[78,28,79,28],[78,29,79,29],[78,31,79,31],[78,33,79,33],[78,35,79,35],[76,30,77,30],[76,24,77,24],[76,25,77,25],[76,26,77,26],[76,28,77,28],[80,30,81,30],[78,30,79,30],[80,28,81,28],[80,29,81,29],[72,28,73,28],[72,29,73,29],[72,31,73,31],[72,33,73,33],[72,35,73,35],[74,24,75,24],[74,25,75,25],[74,26,75,26],[74,28,75,28],[74,29,75,29],[74,31,75,31],[74,33,75,33],[74,35,75,35],[74,30,75,30],[92,9,93,9],[92,10,93,10],[90,9,91,9],[90,10,91,10],[88,9,89,9],[88,10,89,10],[86,9,87,9],[86,10,87,10],[84,9,85,9],[84,10,85,10],[82,9,83,9],[82,10,83,10],[80,9,81,9],[80,10,81,10],[76,9,77,9],[76,10,77,10],[78,9,79,9],[78,10,79,10],[72,9,73,9],[72,10,73,10],[74,9,75,9],[74,10,75,10],[56,2,57,2],[56,3,57,3],[56,4,57,4],[56,6,57,6],[56,7,57,7],[56,8,57,8],[56,9,57,9],[56,10,57,10],[56,11,57,11],[54,2,55,2],[54,3,55,3],[54,4,55,4],[54,6,55,6],[54,7,55,7],[54,8,55,8],[54,9,55,9],[54,10,55,10],[54,11,55,11],[52,2,53,2],[52,3,53,3],[52,4,53,4],[52,6,53,6],[52,7,53,7],[52,8,53,8],[52,9,53,9],[52,10,53,10],[52,11,53,11],[50,2,51,2],[50,3,51,3],[50,4,51,4],[50,6,51,6],[50,7,51,7],[50,8,51,8],[50,9,51,9],[50,10,51,10],[50,11,51,11],[48,2,49,2],[48,3,49,3],[48,4,49,4],[48,6,49,6],[48,7,49,7],[48,8,49,8],[48,9,49,9],[48,10,49,10],[48,11,49,11],[40,11,41,11],[44,8,45,8],[44,9,45,9],[44,10,45,10],[44,11,45,11],[46,2,47,2],[46,3,47,3],[46,4,47,4],[46,6,47,6],[46,7,47,7],[46,8,47,8],[46,9,47,9],[46,10,47,10],[46,11,47,11],[44,2,45,2],[44,3,45,3],[44,4,45,4],[44,6,45,6],[44,7,45,7],[42,2,43,2],[42,3,43,3],[42,4,43,4],[42,6,43,6],[42,7,43,7],[38,9,39,9],[38,10,39,10],[40,2,41,2],[40,3,41,3],[40,4,41,4],[40,6,41,6],[40,7,41,7],[40,8,41,8],[40,9,41,9],[38,2,39,2],[38,3,39,3],[38,4,39,4],[38,6,39,6],[38,7,39,7],[38,8,39,8],[40,10,41,10],[42,8,43,8],[42,9,43,9],[42,10,43,10],[42,11,43,11],[0,0,5,7],[0,8,0,10],[6,0,6,10],[7,0,7,1],[7,2,7,3],[13,2,13,3],[14,0,14,1],[14,2,14,3],[15,0,15,10],[16,0,16,1],[16,4,16,10],[7,4,7,10],[8,0,8,1],[8,2,8,3],[8,4,14,10],[9,0,9,1],[9,2,9,3],[10,0,10,1],[10,2,10,3],[11,0,12,1],[13,0,13,1],[23,2,23,3],[23,6,23,10],[24,2,24,3],[24,6,24,10],[17,4,18,10],[19,4,19,10],[20,0,20,10],[21,0,22,1],[21,2,22,3],[21,4,21,5],[21,6,22,10],[20,22,20,31],[21,22,22,23],[21,24,22,25],[21,26,21,27],[16,28,16,31],[21,28,21,29],[21,30,24,32],[17,28,19,32],[7,22,7,23],[7,24,7,25],[8,22,8,23],[8,24,8,25],[9,22,9,23],[9,24,9,25],[10,22,10,23],[10,24,10,25],[11,22,12,23],[13,22,13,23],[13,24,13,25],[14,22,14,23],[14,24,14,25],[8,26,14,32],[7,26,7,32],[23,24,23,25],[24,24,24,25],[5,40,5,50],[6,40,6,41],[6,42,6,43],[6,44,6,50],[7,40,7,41],[7,42,7,43],[7,44,13,50],[8,40,8,41],[8,42,8,43],[9,40,9,41],[9,42,9,43],[10,40,11,41],[12,40,12,41],[12,42,12,43],[13,40,13,41],[13,42,13,43],[14,40,14,50],[15,40,15,41],[15,44,15,50],[16,44,17,50],[15,22,15,31],[16,22,16,23],[18,44,18,50],[19,40,19,50],[20,40,21,41],[20,42,21,43],[20,44,20,45],[20,46,21,50],[22,42,22,43],[22,46,22,50],[23,42,23,43],[23,46,23,50]]}
["Translate research into private practice",null,null,null,null,null,null,null,"Key for colour codes"]
[null,null,null,null,null,null,null,null," Robot Colour Codes","VAS pain","Difference between injured and uninjured"]
[null,null,null,null,null,null,null,null,"Red ","6-10","0-69%"]
[null,null,null,null,null,null,null,null,"Orange ","4-6","70-85%"]
[null,null,null,null,null,null,null,null,"Green","0-3","85-100%"]
[null,null,null,null,null,null,null,null,null,null,null,null,null,null,null,null,null,null,null,null,null,null,null,null,null,null,null,null,null,null,null,null,null,null,null,null,null,null,null,null," Patient Demographics"]
[" Patient Demographics",null,null,null,null,null,null,null,null,null,null,null,null,null,null,null,null,null,null,null,null,null," Patient Demographics",null,null,null,null,null,null,null,null,null,null,null,null,null,null,null,null,null,"Initial assesment ",null,2,null," Clinical summary"]
["Initial assesment ",null,2,null," Clinical summary",null,null,null,null,null,null,null,null,null,null,null,null,null,null,null,null,null,"Initial assesment ",null,2,null," Clinical summary",null,null,null,null,null,null,null,null,null,null,null,null,null,"Date:",null,"2022-06-05",null,"JANIE HARDLOOP IN DIE PAD"]
["Date:",null,"2022-06-05",null,"JANIE HARDLOOP IN DIE PAD",null,null,null,null,null,null,null,null,null,null,null,null,null,null,null,null,null,"Date:",null,"2022-06-05",null,"JANIE HARDLOOP IN DIE PAD",null,null,null,null,null,null,null,null,null,null,null,null,null,"Name & Surname:",null,"Koos"]
["Name & Surname:",null,"Koos",null,null,null,null,null,null,null,null,null,null,null,null,null,null,null,null,null,null,null,"Name & Surname:",null,"Koos",null,null,null,null,null,null,null,null,null,null,null,null,null,null,null,"Field",null,"Orthopeadic"]
["Field",null,"Orthopeadic",null,null,null,null,null,null,null,null,null,null,null,null,null,null,null,null,null,null,null,"Field",null,"Orthopeadic",null,null,null,null,null,null,null,null,null,null,null,null,null,null,null,"Diagnose: ",null,"Primary","Secondary"]
["Diagnose: ",null,"Primary","Secondary",null,null,null,null,null,null,null,null,null,null,null,null,null,null,null,null,null,null,"Diagnose: ",null,"Primary","Secondary",null,null,null,null,null,null,null,null,null,null,null,null,null,null,null,null,"ACLR","nslbp"]
[null,null,"ACLR","nslbp",null,null,null,null,null,null,null,null,null,null,null,null,null,null,null,null,null,null,null,null,"ACLR","nslbp",null,null,null,null,null,null,null,null,null,null,null,null,null,null,"Months/weeks after injury",null,"5 months"]
["Months/weeks after injury",null,"5 months",null,null,null,null,null,null,null,null,null,null,null,null,null,null,null,null,null,null,null,"Months/weeks after injury",null,"5 months",null,null,null,null,null,null,null,null,null,null,null,null,null,null,null,"Patient Goal",null,"Performance"]
["Patient Goal",null,"Performance",null,null,null,null,null,null,null,null,null,null,null,null,null,null,null,null,null,null,null,"Patient Goal",null,"Performance",null,null,null,null,null,null,null,null,null,null,null,null,null,null,null,"Patient Reported Outcomes Measures (PROM)"]
["Patient Reported Outcomes Measures (PROM)",null,null,null,null,null,null,null,null,null,null,null,null,null,null,null,null,null,null,null,null,null,"Patient Reported Outcomes Measures (PROM)",null,null,null,null,null,null,null,null,null,null,null,null,null,null,null,null,null," Subjective Scoring Sheet",null,"Current score ","Bench mark ","Comments"]
[" Subjective Scoring Sheet",null,"Current score ","Bench mark ","Comments",null,null,null,null,null,null,null,null,null,null,null,null,null,null,null,null,null," Subjective Scoring Sheet",null,"Current Score","Initial Ass","Bench mark ","Progress","Comments",null,null,null,null,null,null,null,null,null,null,null,"Initial Eval","Ankle and Foot",0.56000000000000005,0.67,"djhgsklhfaksjdhakldhakjhdakdh"]
["Initial Eval","Ankle and Foot",0.56000000000000005,0.67,"djhgsklhfaksjdhakldhakjhdakdh",null,null,null,null,null,null,null,null,null,null,null,null,null,null,null,null,null,"Initial Eval","Ankle and Foot",0.78,0.56000000000000005,0.9,{"$f":"Y18-Z18","v":0.21999999999999997},null,null,null,null,null,null,null,null,null,null,null,null,"Initial","Oswestry Disability Index",0.44,0.78]
["Initial","Oswestry Disability Index",0.44,0.78,null,null,null,null,null,null,null,null,null,null,null,null,null,null,null,null,null,null,"Initial","Oswestry Disability Index",0.78,0.44,0.9,{"$f":"Y19-Z19","v":0.34},null,null,null,null,null,null,null,null,null,null,null,null,"Initial","Lower leg",0.67,0.89]
["Initial","Lower leg",0.67,0.89,null,null,null,null,null,null,null,null,null,null,null,null,null,null,null,null,null,null,"Initial","Lower leg",0.78,0.67,0.9,0.10999999999999999,null,null,null,null,null,null,null,null,null,null,null,null,"Patient Reported VAS Pain "]
["Patient Reported VAS Pain ",null,null,null,null,null,null,null,null,null,null,null,null,null,null,null,null,null,null,null,null,null,"Patient Reported VAS Pain ",null,null,null,null,null,null,null,null,null,null,null,null,null,null,null,null,null," Pain Outcome measure during activity or rest",null,"Location/area/referred",null,"Current",null,"Comments"]
[" Pain Outcome measure during activity or rest",null,"Location/area/referred",null,"Current",null,"Comments",null,null,null,null,null,null,null,null,null,null,null,null,null,null,null," Pain Outcome measure during activity or rest",null,"Location/area/referred",null,"Current",null,"Current",null,null,null,null,null,null,null,null,null,null,null,null,null,null,null,"Involved (/10)","Uninvolved(/10)"]
[null,null,null,null,"Involved (/10)","Uninvolved(/10)",null,null,null,null,null,null,null,null,null,null,null,null,null,null,null,null,null,null,null,null,"Involved (/10)","Uninvolved(/10)","Involved (/10)","Uninvolved(/10)",null,null,null,null,null,null,null,null,null,null,"Initial","xdfsd","d",null,3,0," Fig 1: strtwetwr"]
["Initial","xdfsd","d",null,3,0," Fig 1: strtwetwr",null,null,null,null,null,null,null,null,null,null,null,null,null,null,null,"Initial","xdfsd","d",null,3,0,2,0,null,null,null,null,null,null,null,null,null,null,"Initial","xdgdg","cfgdfg",null,4,0,"Fig 2: wtwrwrw"]
["Initial","xdgdg","cfgdfg",null,4,0,"Fig 2: wtwrwrw",null,null,null,null,null,null,null,null,null,null,null,null,null,null,null,"Initial","xdgdg","cfgdfg",null,4,0,4,0]
[]
[]
["Start at INITIAL for FIRST ASSESSMENT"]
[null,null,null,null,null,null,null,null,null,null,null,null,null,0.8]
[]
[null,null,null,null,null,null,null,null,"Factor",0.85,1]
["Move to Progress 1 if not first assessment ----> --------------------->---------------------->-------------",null,null,null,null,null,null,null,null,null,null,null,null,null,null,null,null,null,null,null,null,"Move to progress 2 if progression made for final evaluation ---->-------------->------------->"]
[]
[]
[]
["INITIAL",null,"Performance Based Outcomes Measures (PBOM)-Unilateral",null,null,null,null,null,null,null,null,null,null,null,null,null,null,null,null,null,"Progress 1",null,null,null,null,null,null,null,null,null,null,null,null,null,null,null,null,null,null,"Progress 2"]
[null,null,"Musculoskeletal outcomes",null,"Test descriptor","Equipment","Injured","Uninjured ","Bench mark","Benchmark","Comparisons","Difference","Target",null,null,null,null,null,null,null,null,"Musculoskeletal outcomes",null,"Test descriptor","Equipment","Injured","Uninjured ","Bench mark","Benchmark","Comparisons","Difference","Target","TEST 2 RESULTS","Post treatment test",null,null,null,null,null,null,"Musculoskeletal outcomes",null,"Test descriptor","Equipment","Injured","Uninjured ","Bench mark","Benchmark","Comparisons","Difference","Target"]
[null,null,null,null,null,"Metric",null,null,null,null,null,null," Performance Deficit","Test 1 Results ","Post treatment test",null,null,null,null,null,null,null,null,null,"Metric",null,null,null,null,null,null," Performance Deficit",null,null,null,null,null,null,null,null,null,null,null,"Metric",null,null,null,null,null,null," Performance Deficit","Test 3 Results","Post treatment test",null,null,null,null,"Test 4 results"]
[null,null,"Initial Eval",null,"u","Goniometre",17,15,25,{"$f":"IF(I39>0,I39,H39)","v":25},{"$f":"IF(OR(AND((H39/J39>$J$31),H39/J39<$K$31),I39=0), \"Injured vs uninjured\", \"Injured vs benchmark\")","v":"Injured vs benchmark"},{"$f":"IF(K39=\"Injured vs uninjured\", G39/H39,G39/J39)","v":0.68},0.9,{"$f":"IF(L39>=85%,\"Pass\",IF(L39<85%,\"Fail\",\"Error\"))","v":"Fail"},"Injured","Uninjured","Benchmark",{"$f":"IF(OR(AND((P40/Q40>$J$31),P40/Q40<$K$31),I39=0), \"Injured vs uninjured\", \"Injured vs benchmark\")","v":"Injured vs uninjured"},{"$f":"IF(R39=\"Injured vs uninjured\", O40/P40,O40/Q40)","v":0.95454545454545459},{"$f":"IF(S39>=85%,\"Pass\",IF(S39<85%,\"Fail\",\"Error\"))","v":"Pass"},null,"Progress 1  ",null,"Leg press","Biodex",125,160,200,{"$f":"IF(AB39>0,AB39,AA39)","v":200},{"$f":"IF(OR(AND((AA39/AC39>$J$31),AA39/AC39<$K$31),AB39=0), \"Injured vs uninjured\", \"Injured vs benchmark\")","v":"Injured vs benchmark"},{"$f":"IF(AD39=\"Injured vs uninjured\", Z39/AA39,Z39/AC39)","v":0.625},1,{"$f":"IF(AE39>=85%,\"Pass\",IF(AE39<85%,\"Fail\",\"Error\"))","v":"Fail"},"Injured","Uninjured","Benchmark",{"$f":"IF(OR(AND((AI40/AJ40>$J$31),AI40/AJ40<$K$31),AC39=0), \"Injured vs uninjured\", \"Injured vs benchmark\")","v":"Injured vs uninjured"},{"$f":"IF(AK39=\"Injured vs Uninjured\", AH40/AI40,AH40/AC39)","v":0.8146067415730337},{"$f":"IF(AL39>=85%,\"Pass\",IF(AL39<85%,\"Fail\",\"Error\"))","v":"Fail"},null,"Progress 2",null,"fsd","Stopwatch",17,24,34,{"$f":"IF(AU39>0,AU39,AT39)","v":34},{"$f":"IF(OR(AND((AT39/AV39>$J$31),AT39/AV39<$K$31),AU39=0), \"Injured vs uninjured\", \"Injured vs benchmark\")","v":"Injured vs benchmark"},{"$f":"IF(AW39=\"Injured vs Uninjured\", AS39/AT39,AS39/AV39)","v":0.5},1,{"$f":"IF(AX39>=85%,\"Pass\",IF(AX39<85%,\"Fail\",\"Error\"))","v":"Fail"},"Injured","Uninjured","Benchmark",{"$f":"IF(OR(AND((BB40/BC40>$J$31),BB40/BC40<$K$31),AV39=0), \"Injured vs uninjured\", \"Injured vs benchmark\")","v":"Injured vs uninjured"},{"$f":"IF(BD39=\"Injured vs Uninjured\", BA40/BB40,BA40/BC40)","v":0.9},{"$f":"IF(BE39>=85%,\"Pass\",IF(AX39<85%,\"Fail\",\"Error\"))","v":"Pass"}]
[null,null,null,null,null,"Degrees",null,null,null,null,null,null,{"$f":"L39-M39","v":-0.21999999999999997},null,21,22,{"$f":"IF(E39=\"\",\"Ignore\",IF(K39=\"Injured vs Uninjured\",J39,J39))","v":25},null,null,null,null,null,null,null,"Nm",null,null,null,null,null,null,{"$f":"AE39-AF39","v":-0.375},null,145,178,{"$f":"IF(X39=\"\",\"Ignore\",IF(AD39=\"Injured vs Uninjured\",AC39,AC39))","v":200},null,null,null,null,null,null,null,"Seconds",null,null,null,null,null,null,{"$f":"AX39-AY39","v":-0.5},null,27,30,{"$f":"IF(X39=\"Enter New Value\",\"Ignore\",IF(AW39=\"Injured vs Uninjured\",AT39,AV39))","v":34}]
[null,null,{"$f":"C39","v":"Initial Eval"},null,"f","Goniometre",20,20,30,{"$f":"IF(I41>0,I41,H41)","v":30},{"$f":"IF(OR(AND((H41/J41>$J$31),H41/J41<$K$31),I41=0), \"Injured vs uninjured\", \"Injured vs benchmark\")","v":"Injured vs benchmark"},{"$f":"IF(K41=\"Injured vs uninjured\", G41/H41,G41/J41)","v":0.66666666666666663},0.9,{"$f":"IF(L41>=85%,\"Pass\",IF(L41<85%,\"Fail\",\"Error\"))","v":"Fail"},{"$f":"O39","v":"Injured"},{"$f":"P39","v":"Uninjured"},{"$f":"Q39","v":"Benchmark"},{"$f":"IF(OR(AND((P42/Q42>$J$31),P42/Q42<$K$31),I41=0), \"Injured vs uninjured\", \"Injured vs benchmark\")","v":"Injured vs uninjured"},{"$f":"IF(R41=\"Injured vs uninjured\", O42/P42,O42/Q42)","v":0.93103448275862066},{"$f":"IF(S41>=85%,\"Pass\",IF(S41<85%,\"Fail\",\"Error\"))","v":"Pass"},null,{"$f":"V39","v":"Progress 1  "},null,"fh","Biodex",400,780,950,{"$f":"IF(AB41>0,AB41,AA41)","v":950},{"$f":"IF(OR(AND((AA41/AC41>$J$31),AA41/AC41<$K$31),AB41=0), \"Injured vs uninjured\", \"Injured vs benchmark\")","v":"Injured vs benchmark"},{"$f":"IF(AD41=\"Injured vs uninjured\", Z41/AA41,Z41/AC41)","v":0.42105263157894735},1,{"$f":"IF(AE41>=85%,\"Pass\",IF(AE41<85%,\"Fail\",\"Error\"))","v":"Fail"},"Injured",{"$f":"AI39","v":"Uninjured"},{"$f":"AJ39","v":"Benchmark"},{"$f":"IF(OR(AND((AI42/AJ42>$J$31),AI42/AJ42<$K$31),AC41=0), \"Injured vs uninjured\", \"Injured vs benchmark\")","v":"Injured vs uninjured"},{"$f":"IF(AK41=\"Injured vs Uninjured\", AH42/AI42,AH42/AC41)","v":0.61604938271604937},{"$f":"IF(AL41>=85%,\"Pass\",IF(AL41<85%,\"Fail\",\"Error\"))","v":"Fail"},null,"Progress 2",null,"sdfsf","Stopwatch",45,89,120,{"$f":"IF(AU41>0,AU41,AT41)","v":120},{"$f":"IF(OR(AND((AT41/AV41>$J$31),AT41/AV41<$K$31),AU41=0), \"Injured vs uninjured\", \"Injured vs benchmark\")","v":"Injured vs benchmark"},{"$f":"IF(AW41=\"Injured vs Uninjured\", AS41/AT41,AS41/AV41)","v":0.375},0.95,{"$f":"IF(AX41>=85%,\"Pass\",IF(AX41<85%,\"Fail\",\"Error\"))","v":"Fail"},{"$f":"BA39","v":"Injured"},{"$f":"BB39","v":"Uninjured"},{"$f":"BC39","v":"Benchmark"},{"$f":"IF(OR(AND((BB42/BC42>$J$31),BB42/BC42<$K$31),AV41=0), \"Injured vs uninjured\", \"Injured vs benchmark\")","v":"Injured vs benchmark"},{"$f":"IF(BD41=\"Injured vs Uninjured\", BA42/BB42,BA42/BC42)","v":0.55833333333333335},{"$f":"IF(BE41>=85%,\"Pass\",IF(AX41<85%,\"Fail\",\"Error\"))","v":"Fail"}]
[null,null,null,null,null,"Degrees",null,null,null,null,null,null,{"$f":"L41-M41","v":-0.23333333333333339},null,27,29,{"$f":"IF(E41=\"\",\"Ignore\",IF(K41=\"Injured vs Uninjured\",J41,J41))","v":30},null,null,null,null,null,null,null,"Kg",null,null,null,null,null,null,{"$f":"AE41-AF41","v":-0.57894736842105265},null,499,810,{"$f":"IF(X41=\"\",\"Ignore\",IF(AD41=\"Injured vs Uninjured\",AC41,AC41))","v":950},null,null,null,null,null,null,null,"Joule",null,null,null,null,null,null,{"$f":"AX41-AY41","v":-0.57499999999999996},null,67,98,{"$f":"IF(X39=\"Enter New Value\",\"Ignore\",IF(AW41=\"Injured vs Uninjured\",AT41,AV41))","v":120}]
[null,null,{"$f":"C41","v":"Initial Eval"},null,"g","MicroFit/Biofet",40,70,0,{"$f":"IF(I43>0,I43,H43)","v":70},{"$f":"IF(OR(AND((H43/J43>$J$31),H43/J43<$K$31),I43=0), \"Injured vs uninjured\", \"Injured vs benchmark\")","v":"Injured vs uninjured"},{"$f":"IF(K43=\"Injured vs uninjured\", G43/H43,G43/J43)","v":0.5714285714285714},0.9,{"$f":"IF(L43>=85%,\"Pass\",IF(L43<85%,\"Fail\",\"Error\"))","v":"Fail"},{"$f":"O41","v":"Injured"},"Uninjured",{"$f":"Q41","v":"Benchmark"},{"$f":"IF(OR(AND((P44/Q44>$J$31),P44/Q44<$K$31),I43=0), \"Injured vs uninjured\", \"Injured vs benchmark\")","v":"Injured vs uninjured"},{"$f":"IF(R43=\"Injured vs uninjured\", O44/P44,O44/Q44)","v":0.67164179104477617},{"$f":"IF(S43>=85%,\"Pass\",IF(S43<85%,\"Fail\",\"Error\"))","v":"Fail"},null,{"$f":"V41","v":"Progress 1  "},null,"fg","DynoMo",60,100,0,{"$f":"IF(AB43>0,AB43,AA43)","v":100},{"$f":"IF(OR(AND((AA43/AC43>$J$31),AA43/AC43<$K$31),AB43=0), \"Injured vs uninjured\", \"Injured vs benchmark\")","v":"Injured vs uninjured"},{"$f":"IF(AD43=\"Injured vs uninjured\", Z43/AA43,Z43/AC43)","v":0.6},1,{"$f":"IF(AE43>=85%,\"Pass\",IF(AE43<85%,\"Fail\",\"Error\"))","v":"Fail"},"Injured",{"$f":"AI41","v":"Uninjured"},{"$f":"AJ41","v":"Benchmark"},{"$f":"IF(OR(AND((AI44/AJ44>$J$31),AI44/AJ44<$K$31),AC43=0), \"Injured vs uninjured\", \"Injured vs benchmark\")","v":"Injured vs uninjured"},{"$f":"IF(AK43=\"Injured vs Uninjured\", AH44/AI44,AH44/AC43)","v":0.86206896551724133},{"$f":"IF(AL43>=85%,\"Pass\",IF(AL43<85%,\"Fail\",\"Error\"))","v":"Pass"},null,"Progress 2",null,"fss","MicroFit/Biofet",67,78,100,{"$f":"IF(AU43>0,AU43,AT43)","v":100},{"$f":"IF(OR(AND((AT43/AV43>$J$31),AT43/AV43<$K$31),AU43=0), \"Injured vs uninjured\", \"Injured vs benchmark\")","v":"Injured vs benchmark"},{"$f":"IF(AW43=\"Injured vs Uninjured\", AS43/AT43,AS43/AV43)","v":0.67},0.95,{"$f":"IF(AX43>=85%,\"Pass\",IF(AX43<85%,\"Fail\",\"Error\"))","v":"Fail"},{"$f":"BA41","v":"Injured"},"Uninjured","Benchmark",{"$f":"IF(OR(AND((BB44/BC44>$J$31),BB44/BC44<$K$31),AV43=0), \"Injured vs uninjured\", \"Injured vs benchmark\")","v":"Injured vs benchmark"},{"$f":"IF(BD43=\"Injured vs Uninjured\", BA44/BB44,BA44/BC44)","v":0.89},{"$f":"IF(BE43>=85%,\"Pass\",IF(AX43<85%,\"Fail\",\"Error\"))","v":"Pass"}]
[null,null,null,null,null,"Joule",null,null,null,null,null,null,{"$f":"L43-M43","v":-0.32857142857142863},null,45,67,{"$f":"IF(E43=\"\",\"Ignore\",IF(K43=\"Injured vs Uninjured\",J43,J43))","v":70},null,null,null,null,null,null,null,"Joule",null,null,null,null,null,null,{"$f":"AE43-AF43","v":-0.4},null,75,87,{"$f":"IF(X43=\"\",\"Ignore\",IF(AD43=\"Injured vs Uninjured\",AC43,AC43))","v":100},null,null,null,null,null,null,null,"Joule",null,null,null,null,null,null,{"$f":"AX43-AY43","v":-0.27999999999999992},null,89,78,{"$f":"IF(X39=\"Enter New Value\",\"Ignore\",IF(AW43=\"Injured vs Uninjured\",AT43,AV43))","v":100}]
[null,null,{"$f":"C43","v":"Initial Eval"},null,"p","Step",15,15,0,{"$f":"IF(I45>0,I45,H45)","v":15},{"$f":"IF(OR(AND((H45/J45>$J$31),H45/J45<$K$31),I45=0), \"Injured vs uninjured\", \"Injured vs benchmark\")","v":"Injured vs uninjured"},{"$f":"IF(K45=\"Injured vs uninjured\", G45/H45,G45/J45)","v":1},1,{"$f":"IF(L45>=85%,\"Pass\",IF(L45<85%,\"Fail\",\"Error\"))","v":"Pass"},{"$f":"O43","v":"Injured"},"Uninjured","Benchmark",{"$f":"IF(OR(AND((P46/Q46>$J$31),P46/Q46<$K$31),I45=0), \"Injured vs uninjured\", \"Injured vs benchmark\")","v":"Injured vs uninjured"},{"$f":"IF(R45=\"Injured vs uninjured\", O46/P46,O46/Q46)","v":1},{"$f":"IF(S45>=85%,\"Pass\",IF(S45<85%,\"Fail\",\"Error\"))","v":"Pass"},null,{"$f":"V43","v":"Progress 1  "},null,"xgf","MicroFit/Biofet",5,7,9,{"$f":"IF(AB45>0,AB45,AA45)","v":9},{"$f":"IF(OR(AND((AA45/AC45>$J$31),AA45/AC45<$K$31),AB45=0), \"Injured vs uninjured\", \"Injured vs benchmark\")","v":"Injured vs benchmark"},{"$f":"IF(AD45=\"Injured vs uninjured\", Z45/AA45,Z45/AC45)","v":0.55555555555555558},1,{"$f":"IF(AE45>=85%,\"Pass\",IF(AE45<85%,\"Fail\",\"Error\"))","v":"Fail"},"Injured",{"$f":"AI41","v":"Uninjured"},{"$f":"AJ43","v":"Benchmark"},{"$f":"IF(OR(AND((AI46/AJ46>$J$31),AI46/AJ46<$K$31),AC45=0), \"Injured vs uninjured\", \"Injured vs benchmark\")","v":"Injured vs benchmark"},{"$f":"IF(AK45=\"Injured vs Uninjured\", AH46/AI46,AH46/AC45)","v":0.88888888888888884},{"$f":"IF(AL45>=85%,\"Pass\",IF(AL45<85%,\"Fail\",\"Error\"))","v":"Pass"},null,"Progress 2",null,"sf","MicroFit/Biofet",5,8,10,{"$f":"IF(AU45>0,AU45,AT45)","v":10},{"$f":"IF(OR(AND((AT45/AV45>$J$31),AT45/AV45<$K$31),AU45=0), \"Injured vs uninjured\", \"Injured vs benchmark\")","v":"Injured vs benchmark"},{"$f":"IF(AW45=\"Injured vs Uninjured\", AS45/AT45,AS45/AV45)","v":0.5},0.95,{"$f":"IF(AX45>=85%,\"Pass\",IF(AX45<85%,\"Fail\",\"Error\"))","v":"Fail"},{"$f":"BA43","v":"Injured"},"Uninjured","Benchmark",{"$f":"IF(OR(AND((BB46/BC46>$J$31),BB46/BC46<$K$31),AV45=0), \"Injured vs uninjured\", \"Injured vs benchmark\")","v":"Injured vs uninjured"},{"$f":"IF(BD45=\"Injured vs Uninjured\", BA46/BB46,BA46/BC46)","v":0.88888888888888884},{"$f":"IF(BE45>=85%,\"Pass\",IF(AX45<85%,\"Fail\",\"Error\"))","v":"Pass"}]
[null,null,null,null,null,"Numeric value",null,null,null,null,null,null,{"$f":"L45-M45","v":0},null,{"$f":"IF(N45=\"pass\",G45,\"Enter New Value\")","v":15},{"$f":"IF(N45=\"pass\",H45,\"Enter New Value\")","v":15},{"$f":"IF(E45=\"\",\"Ignore\",IF(K45=\"Injured vs Uninjured\",H45,I45))","v":15},null,null,null,null,null,null,null,"Joule",null,null,null,null,null,null,{"$f":"AE45-AF45","v":-0.44444444444444442},null,8,9,{"$f":"IF(X45=\"\",\"Ignore\",IF(AD45=\"Injured vs Uninjured\",AC45,AC45))","v":9},null,null,null,null,null,null,null,"Joule",null,null,null,null,null,null,{"$f":"AX45-AY45","v":-0.44999999999999996},null,8,9,{"$f":"IF(X39=\"Enter New Value\",\"Ignore\",IF(AW45=\"Injured vs Uninjured\",AT45,AV45))","v":10}]
[null,null,{"$f":"C45","v":"Initial Eval"},null,"h","MicroFit/Biofet",23,56,78,{"$f":"IF(I47>0,I47,H47)","v":78},{"$f":"IF(OR(AND((H47/J47>$J$31),H47/J47<$K$31),I47=0), \"Injured vs uninjured\", \"Injured vs benchmark\")","v":"Injured vs benchmark"},{"$f":"IF(K47=\"Injured vs uninjured\", G47/H47,G47/J47)","v":0.29487179487179488},1,{"$f":"IF(L47>=85%,\"Pass\",IF(L47<85%,\"Fail\",\"Error\"))","v":"Fail"},{"$f":"O45","v":"Injured"},"Uninjured","Benchmark","Injured vs benchmark",{"$f":"IF(R47=\"Injured vs uninjured\", O48/P48,O48/Q48)","v":0.83333333333333337},{"$f":"IF(S47>=85%,\"Pass\",IF(S47<85%,\"Fail\",\"Error\"))","v":"Fail"},null,{"$f":"V45","v":"Progress 1  "},null,"aaa","MicroFit/Biofet",45,78,0,{"$f":"IF(AB47>0,AB47,AA47)","v":78},{"$f":"IF(OR(AND((AA47/AC47>$J$31),AA47/AC47<$K$31),AB47=0), \"Injured vs uninjured\", \"Injured vs benchmark\")","v":"Injured vs uninjured"},{"$f":"IF(AD47=\"Injured vs uninjured\", Z47/AA47,Z47/AC47)","v":0.57692307692307687},1,{"$f":"IF(AE47>=85%,\"Pass\",IF(AE47<85%,\"Fail\",\"Error\"))","v":"Fail"},"Injured",{"$f":"AI45","v":"Uninjured"},{"$f":"AJ45","v":"Benchmark"},{"$f":"IF(OR(AND((AI48/AJ48>$J$31),AI48/AJ48<$K$31),AC47=0), \"Injured vs uninjured\", \"Injured vs benchmark\")","v":"Injured vs benchmark"},{"$f":"IF(AK47=\"Injured vs Uninjured\", AH48/AI48,AH48/AC47)","v":0.85897435897435892},{"$f":"IF(AL47>=85%,\"Pass\",IF(AL47<85%,\"Fail\",\"Error\"))","v":"Pass"},null,"Progress 2",null,"sfs","MicroFit/Biofet",555,666,1000,{"$f":"IF(AU47>0,AU47,AT47)","v":1000},{"$f":"IF(OR(AND((AT47/AV47>$J$31),AT47/AV47<$K$31),AU47=0), \"Injured vs uninjured\", \"Injured vs benchmark\")","v":"Injured vs benchmark"},{"$f":"IF(AW47=\"Injured vs Uninjured\", AS47/AT47,AS47/AV47)","v":0.55500000000000005},0.95,{"$f":"IF(AX47>=85%,\"Pass\",IF(AX47<85%,\"Fail\",\"Error\"))","v":"Fail"},{"$f":"BA45","v":"Injured"},"Uninjured","Benchmark",{"$f":"IF(OR(AND((BB48/BC48>$J$31),BB48/BC48<$K$31),AV47=0), \"Injured vs uninjured\", \"Injured vs benchmark\")","v":"Injured vs uninjured"},{"$f":"IF(BD47=\"Injured vs Uninjured\", BA48/BB48,BA48/BC48)","v":0.875},{"$f":"IF(BE47>=85%,\"Pass\",IF(AX47<85%,\"Fail\",\"Error\"))","v":"Pass"}]
[null,null,null,null,null,"Kg",null,null,null,null,null,null,{"$f":"L47-M47","v":-0.70512820512820507},null,65,66,{"$f":"IF(E47=\"\",\"Ignore\",IF(K47=\"Injured vs Uninjured\",J47,J47))","v":78},null,null,null,null,null,null,null,"Joule",null,null,null,null,null,null,{"$f":"AE47-AF47","v":-0.42307692307692313},null,67,80,{"$f":"IF(X47=\"\",\"Ignore\",IF(AD47=\"Injured vs Uninjured\",AC47,AC47))","v":78},null,null,null,null,null,null,null,"Joule",null,null,null,null,null,null,{"$f":"AX47-AY47","v":-0.39499999999999991},null,777,888,{"$f":"IF(X39=\"Enter New Value\",\"Ignore\",IF(AW47=\"Injured vs Uninjured\",AT47,AV47))","v":1000}]
[null,null,{"$f":"C47","v":"Initial Eval"},null,null,"MicroFit/Biofet",null,null,null,{"$f":"IF(I49>0,I49,H49)","v":0},{"$f":"#REF!","v":{"$error":"#REF!"}},{"$f":"#REF!","v":{"$error":"#REF!"}},0.95,null,"Injured",null,"Uninjured",null,{"$f":"K85","v":{"$error":"#DIV/0!"}},null,null,{"$f":"V47","v":"Progress 1  "},{"$f":"D39","v":0},{"$f":"E39","v":"u"},{"$f":"F39","v":"Goniometre"},{"$f":"O40","v":21},{"$f":"P40","v":22},{"$f":"J39","v":25},{"$f":"IF(AB49>0,AB49,AA49)","v":25},{"$f":"IF(OR(AND((AA49/AC49>$J$31),AA49/AC49<$K$31),AB49=0), \"Injured vs uninjured\", \"Injured vs benchmark\")","v":"Injured vs uninjured"},{"$f":"IF(AD49=\"Injured vs uninjured\", Z49/AA49,Z49/AC49)","v":0.95454545454545459},{"$f":"M39","v":0.9},{"$f":"IF(AE49>=85%,\"Pass\",IF(AE49<85%,\"Fail\",\"Error\"))","v":"Pass"},{"$f":"AH47","v":"Injured"},{"$f":"AI47","v":"Uninjured"},{"$f":"AJ47","v":"Benchmark"},{"$f":"IF(OR(AND((AI50/AJ50>$J$31),AI50/AJ50<$K$31),AC49=0), \"Injured vs uninjured\", \"Injured vs benchmark\")","v":"Injured vs uninjured"},{"$f":"IF(AK49=\"Injured vs Uninjured\", AH50/AI50,AH50/AC49)","v":0.95454545454545459},{"$f":"IF(AL49>=85%,\"Pass\",IF(AL49<85%,\"Fail\",\"Error\"))","v":"Pass"},null,"Progress 2",{"$f":"W39","v":0},{"$f":"X39","v":"Leg press"},{"$f":"Y39","v":"Biodex"},{"$f":"AH40","v":145},{"$f":"AI40","v":178},{"$f":"AC39","v":200},200,{"$f":"IF(OR(AND((AT49/AV49>$J$31),AT49/AV49<$K$31),AU49=0), \"Injured vs uninjured\", \"Injured vs benchmark\")","v":"Injured vs uninjured"},{"$f":"IF(AW49=\"Injured vs Uninjured\", AS49/AT49,AS49/AV49)","v":0.8146067415730337},{"$f":"AF39","v":1},{"$f":"IF(AX49>=85%,\"Pass\",IF(AX49<85%,\"Fail\",\"Error\"))","v":"Fail"},{"$f":"BA47","v":"Injured"},"Uninjured","Benchmark",{"$f":"IF(OR(AND((BB50/BC50>$J$31),BB50/BC50<$K$31),AV49=0), \"Injured vs uninjured\", \"Injured vs benchmark\")","v":"Injured vs benchmark"},{"$f":"IF(BD49=\"Injured vs Uninjured\", BA50/BB50,BA50/BC50)","v":1},{"$f":"IF(BE49>=85%,\"Pass\",IF(AX49<85%,\"Fail\",\"Error\"))","v":"Pass"}]
[null,null,null,null,null,"Joule",null,null,null,null,null,null,{"$f":"L49-M49","v":{"$error":"#REF!"}},null,null,null,null,null,null,null,null,null,null,null,{"$f":"F40","v":"Degrees"},null,null,null,null,null,null,{"$f":"AE49-AF49","v":5.4545454545454564E-2},null,{"$f":"IF(AG49=\"pass\",Z49,\"Enter New Value\")","v":21},{"$f":"IF(AG49=\"pass\",AA49,\"Enter New Value\")","v":22},{"$f":"IF(X49=\"\",\"Ignore\",IF(AD49=\"Injured vs Uninjured\",AC49,AC49))","v":25},null,null,null,null,null,null,null,{"$f":"Y40","v":"Nm"},null,null,null,null,null,null,{"$f":"AX49-AY49","v":-0.1853932584269663},null,178,178,{"$f":"IF(X39=\"Enter New Value\",\"Ignore\",IF(AW49=\"Injured vs Uninjured\",AT49,AV49))","v":178}]
[null,null,{"$f":"C49","v":"Initial Eval"},null,null,"MicroFit/Biofet",null,null,null,{"$f":"IF(I51>0,I51,H51)","v":0},{"$f":"#REF!","v":{"$error":"#REF!"}},{"$f":"#REF!","v":{"$error":"#REF!"}},0.95,null,"Injured",null,"Uninjured",null,{"$f":"K87","v":{"$error":"#DIV/0!"}},null,null,{"$f":"V49","v":"Progress 1  "},{"$f":"D41","v":0},{"$f":"E41","v":"f"},"Goniometre",{"$f":"O42","v":27},{"$f":"P42","v":29},{"$f":"J41","v":30},{"$f":"IF(AB51>0,AB51,AA51)","v":30},{"$f":"IF(OR(AND((AA51/AC51>$J$31),AA51/AC51<$K$31),AB51=0), \"Injured vs uninjured\", \"Injured vs benchmark\")","v":"Injured vs uninjured"},{"$f":"IF(AD51=\"Injured vs uninjured\", Z51/AA51,Z51/AC51)","v":0.93103448275862066},{"$f":"M41","v":0.9},{"$f":"IF(AE51>=85%,\"Pass\",IF(AE51<85%,\"Fail\",\"Error\"))","v":"Pass"},{"$f":"AH49","v":"Injured"},"Uninjured","Benchmark",{"$f":"IF(OR(AND((AI52/AJ52>$J$31),AI52/AJ52<$K$31),AC51=0), \"Injured vs uninjured\", \"Injured vs benchmark\")","v":"Injured vs uninjured"},{"$f":"IF(AK51=\"Injured vs Uninjured\", AH52/AI52,AH52/AC51)","v":0.93103448275862066},{"$f":"IF(AL51>=85%,\"Pass\",IF(AL51<85%,\"Fail\",\"Error\"))","v":"Pass"},null,"Progress 2",{"$f":"W41","v":0},{"$f":"X41","v":"fh"},"Biodex",{"$f":"AH42","v":499},{"$f":"AI42","v":810},{"$f":"AC41","v":950},{"$f":"IF(AU51>0,AU51,AT51)","v":950},{"$f":"IF(OR(AND((AT51/AV51>$J$31),AT51/AV51<$K$31),AU51=0), \"Injured vs uninjured\", \"Injured vs benchmark\")","v":"Injured vs uninjured"},{"$f":"IF(AW51=\"Injured vs Uninjured\", AS51/AT51,AS51/AV51)","v":0.61604938271604937},{"$f":"AF41","v":1},{"$f":"IF(AX51>=85%,\"Pass\",IF(AX51<85%,\"Fail\",\"Error\"))","v":"Fail"},{"$f":"BA49","v":"Injured"},"Uninjured","Benchmark",{"$f":"IF(OR(AND((BB52/BC52>$J$31),BB52/BC52<$K$31),AV51=0), \"Injured vs uninjured\", \"Injured vs benchmark\")","v":"Injured vs benchmark"},{"$f":"IF(BD51=\"Injured vs Uninjured\", BA52/BB52,BA52/BC52)","v":0.86172839506172838},{"$f":"IF(BE51>=85%,\"Pass\",IF(AX51<85%,\"Fail\",\"Error\"))","v":"Pass"}]
[null,null,null,null,null,"Joule",null,null,null,null,null,null,{"$f":"L51-M51","v":{"$error":"#REF!"}},null,null,null,null,{"$f":"56/78","v":0.71794871794871795},null,null,null,null,null,null,"Degrees",null,null,null,null,null,null,{"$f":"AE51-AF51","v":3.1034482758620641E-2},null,{"$f":"IF(AG51=\"pass\",Z51,\"Enter New Value\")","v":27},{"$f":"IF(AG51=\"pass\",AA51,\"Enter New Value\")","v":29},{"$f":"IF(X51=\"\",\"Ignore\",IF(AD51=\"Injured vs Uninjured\",AC51,AC51))","v":30},null,null,null,null,null,null,null,"Kg",null,null,null,null,null,null,{"$f":"AX51-AY51","v":-0.38395061728395063},null,698,900,{"$f":"IF(X39=\"Enter New Value\",\"Ignore\",IF(AW51=\"Injured vs Uninjured\",AT51,AV51))","v":810}]
[null,null,{"$f":"C51","v":"Initial Eval"},null,null,"MicroFit/Biofet",null,null,null,{"$f":"IF(I53>0,I53,H53)","v":0},{"$f":"#REF!","v":{"$error":"#REF!"}},{"$f":"#REF!","v":{"$error":"#REF!"}},0.95,null,"Injured",null,"Uninjured",null,{"$f":"K89","v":{"$error":"#DIV/0!"}},null,null,{"$f":"V51","v":"Progress 1  "},{"$f":"D43","v":0},{"$f":"E43","v":"g"},"MicroFit/Biofet",{"$f":"O44","v":45},{"$f":"P44","v":67},{"$f":"J43","v":70},{"$f":"IF(AB53>0,AB53,AA53)","v":70},{"$f":"IF(OR(AND((AA53/AC53>$J$31),AA53/AC53<$K$31),AB53=0), \"Injured vs uninjured\", \"Injured vs benchmark\")","v":"Injured vs uninjured"},{"$f":"IF(AD53=\"Injured vs uninjured\", Z53/AA53,Z53/AC53)","v":0.67164179104477617},{"$f":"M43","v":0.9},{"$f":"IF(AE53>=85%,\"Pass\",IF(AE53<85%,\"Fail\",\"Error\"))","v":"Fail"},{"$f":"AH51","v":"Injured"},"Uninjured","Benchmark",{"$f":"IF(OR(AND((AI54/AJ54>$J$31),AI54/AJ54<$K$31),AC53=0), \"Injured vs uninjured\", \"Injured vs benchmark\")","v":"Injured vs benchmark"},{"$f":"IF(AK53=\"Injured vs Uninjured\", AH54/AI54,AH54/AC53)","v":0.9285714285714286},{"$f":"IF(AL53>=85%,\"Pass\",IF(AL53<85%,\"Fail\",\"Error\"))","v":"Pass"},null,"Progress 2",{"$f":"W43","v":0},{"$f":"X43","v":"fg"},"DynoMo",{"$f":"AH44","v":75},{"$f":"AI44","v":87},{"$f":"AC43","v":100},100,{"$f":"IF(OR(AND((AT53/AV53>$J$31),AT53/AV53<$K$31),AU53=0), \"Injured vs uninjured\", \"Injured vs benchmark\")","v":"Injured vs uninjured"},{"$f":"IF(AW53=\"Injured vs Uninjured\", AS53/AT53,AS53/AV53)","v":0.86206896551724133},{"$f":"AF43","v":1},{"$f":"IF(AX53>=85%,\"Pass\",IF(AX53<85%,\"Fail\",\"Error\"))","v":"Pass"},{"$f":"BA51","v":"Injured"},"Uninjured","Benchmark",{"$f":"IF(OR(AND((BB54/BC54>$J$31),BB54/BC54<$K$31),AV53=0), \"Injured vs uninjured\", \"Injured vs benchmark\")","v":"Injured vs benchmark"},{"$f":"IF(BD53=\"Injured vs Uninjured\", BA54/BB54,BA54/BC54)","v":0.86206896551724133},{"$f":"IF(BE53>=85%,\"Pass\",IF(AX53<85%,\"Fail\",\"Error\"))","v":"Pass"}]
[null,null,null,null,null,"Joule",null,null,null,null,null,null,{"$f":"L53-M53","v":{"$error":"#REF!"}},null,null,null,null,null,null,null,null,null,null,null,"Joule",null,null,null,null,null,null,{"$f":"AE53-AF53","v":-0.22835820895522385},null,65,78,{"$f":"IF(X53=\"\",\"Ignore\",IF(AD53=\"Injured vs Uninjured\",AC53,AC53))","v":70},null,null,null,null,null,null,null,"Joule",null,null,null,null,null,null,{"$f":"AX53-AY53","v":-0.13793103448275867},null,{"$f":"IF(AZ53=\"Pass\",AS53,\"Enter New Value\")","v":75},95,{"$f":"IF(X39=\"Enter New Value\",\"Ignore\",IF(AW53=\"Injured vs Uninjured\",AT53,AV53))","v":87}]
[null,null,{"$f":"C53","v":"Initial Eval"},null,null,"MicroFit/Biofet",null,null,null,{"$f":"IF(I55>0,I55,H55)","v":0},{"$f":"#REF!","v":{"$error":"#REF!"}},{"$f":"#REF!","v":{"$error":"#REF!"}},0.95,null,"Injured",null,"Uninjured",null,{"$f":"K91","v":{"$error":"#DIV/0!"}},null,null,{"$f":"V53","v":"Progress 1  "},{"$f":"D45","v":0},{"$f":"E45","v":"p"},"Step",{"$f":"O46","v":15},{"$f":"P46","v":15},{"$f":"J45","v":15},{"$f":"IF(AB55>0,AB55,AA55)","v":15},{"$f":"IF(OR(AND((AA55/AC55>$J$31),AA55/AC55<$K$31),AB55=0), \"Injured vs uninjured\", \"Injured vs benchmark\")","v":"Injured vs benchmark"},{"$f":"IF(AD55=\"Injured vs uninjured\", Z55/AA55,Z55/AC55)","v":1},{"$f":"M45","v":1},{"$f":"IF(AE55>=85%,\"Pass\",IF(AE55<85%,\"Fail\",\"Error\"))","v":"Pass"},{"$f":"AH53","v":"Injured"},"Uninjured","Benchmark",{"$f":"IF(OR(AND((AI56/AJ56>$J$31),AI56/AJ56<$K$31),AC55=0), \"Injured vs uninjured\", \"Injured vs benchmark\")","v":"Injured vs benchmark"},{"$f":"IF(AK55=\"Injured vs Uninjured\", AH56/AI56,AH56/AC55)","v":1},{"$f":"IF(AL55>=85%,\"Pass\",IF(AL55<85%,\"Fail\",\"Error\"))","v":"Pass"},null,"Progress 2",{"$f":"W45","v":0},{"$f":"X45","v":"xgf"},"MicroFit/Biofet",{"$f":"AH46","v":8},{"$f":"AI46","v":9},{"$f":"AC45","v":9},9,{"$f":"IF(OR(AND((AT55/AV55>$J$31),AT55/AV55<$K$31),AU55=0), \"Injured vs uninjured\", \"Injured vs benchmark\")","v":"Injured vs benchmark"},{"$f":"IF(AW55=\"Injured vs Uninjured\", AS55/AT55,AS55/AV55)","v":0.88888888888888884},{"$f":"AF45","v":1},{"$f":"IF(AX55>=85%,\"Pass\",IF(AX55<85%,\"Fail\",\"Error\"))","v":"Pass"},{"$f":"BA53","v":"Injured"},"Uninjured","Benchmark",{"$f":"IF(OR(AND((BB56/BC56>$J$31),BB56/BC56<$K$31),AV55=0), \"Injured vs uninjured\", \"Injured vs benchmark\")","v":"Injured vs benchmark"},{"$f":"IF(BD55=\"Injured vs Uninjured\", BA56/BB56,BA56/BC56)","v":0.88888888888888884},{"$f":"IF(BE55>=85%,\"Pass\",IF(AX55<85%,\"Fail\",\"Error\"))","v":"Pass"}]
[null,null,null,null,null,"Joule",null,null,null,null,null,null,{"$f":"L55-M55","v":{"$error":"#REF!"}},null,null,null,null,null,null,null,null,null,null,null,"Numeric value",null,null,null,null,null,null,{"$f":"AE55-AF55","v":0},null,{"$f":"IF(AG55=\"pass\",Z55,\"Enter New Value\")","v":15},{"$f":"IF(AG55=\"pass\",AA55,\"Enter New Value\")","v":15},{"$f":"IF(X55=\"\",\"Ignore\",IF(AD55=\"Injured vs Uninjured\",AC55,AC55))","v":15},null,null,null,null,null,null,null,"Joule",null,null,null,null,null,null,{"$f":"AX55-AY55","v":-0.11111111111111116},null,{"$f":"IF(AZ55=\"Pass\",AS55,\"Enter New Value\")","v":8},{"$f":"IF(AZ55=\"Pass\",AT55,\"Enter New Value\")","v":9},{"$f":"IF(X39=\"Enter New Value\",\"Ignore\",IF(AW55=\"Injured vs Uninjured\",AT55,AV55))","v":9}]
[null,null,{"$f":"C55","v":"Initial Eval"},null,null,"MicroFit/Biofet",null,null,null,{"$f":"IF(I57>0,I57,H57)","v":0},{"$f":"#REF!","v":{"$error":"#REF!"}},{"$f":"#REF!","v":{"$error":"#REF!"}},0.95,null,"Injured",null,"Uninjured",null,{"$f":"K93","v":{"$error":"#DIV/0!"}},null,null,{"$f":"V55","v":"Progress 1  "},{"$f":"D47","v":0},{"$f":"E47","v":"h"},"MicroFit/Biofet",{"$f":"O48","v":65},{"$f":"P48","v":66},{"$f":"J47","v":78},{"$f":"IF(AB57>0,AB57,AA57)","v":78},{"$f":"IF(OR(AND((AA57/AC57>$J$31),AA57/AC57<$K$31),AB57=0), \"Injured vs uninjured\", \"Injured vs benchmark\")","v":"Injured vs benchmark"},{"$f":"IF(AD57=\"Injured vs uninjured\", Z57/AA57,Z57/AC57)","v":0.83333333333333337},{"$f":"M47","v":1},{"$f":"IF(AE57>=85%,\"Pass\",IF(AE57<85%,\"Fail\",\"Error\"))","v":"Fail"},{"$f":"AH55","v":"Injured"},"Uninjured","Benchmark",{"$f":"IF(OR(AND((AI58/AJ58>$J$31),AI58/AJ58<$K$31),AC57=0), \"Injured vs uninjured\", \"Injured vs benchmark\")","v":"Injured vs benchmark"},{"$f":"IF(AK57=\"Injured vs Uninjured\", AH58/AI58,AH58/AC57)","v":0.91025641025641024},{"$f":"IF(AL57>=85%,\"Pass\",IF(AL57<85%,\"Fail\",\"Error\"))","v":"Pass"},null,"Progress 2",{"$f":"W47","v":0},{"$f":"X47","v":"aaa"},"MicroFit/Biofet",{"$f":"AH48","v":67},{"$f":"AI48","v":80},{"$f":"AC47","v":78},78,{"$f":"IF(OR(AND((AT57/AV57>$J$31),AT57/AV57<$K$31),AU57=0), \"Injured vs uninjured\", \"Injured vs benchmark\")","v":"Injured vs benchmark"},{"$f":"IF(AW57=\"Injured vs Uninjured\", AS57/AT57,AS57/AV57)","v":0.85897435897435892},{"$f":"AF47","v":1},{"$f":"IF(AX57>=85%,\"Pass\",IF(AX57<85%,\"Fail\",\"Error\"))","v":"Pass"},{"$f":"BA55","v":"Injured"},"Uninjured","Benchmark",{"$f":"IF(OR(AND((BB58/BC58>$J$31),BB58/BC58<$K$31),AV57=0), \"Injured vs uninjured\", \"Injured vs benchmark\")","v":"Injured vs benchmark"},{"$f":"IF(BD57=\"Injured vs Uninjured\", BA58/BB58,BA58/BC58)","v":0.85897435897435892},{"$f":"IF(BE57>=85%,\"Pass\",IF(AX57<85%,\"Fail\",\"Error\"))","v":"Pass"}]
[null,null,null,null,null,"Joule",null,null,null,null,null,null,{"$f":"L57-M57","v":{"$error":"#REF!"}},null,null,null,null,null,null,null,null,null,null,null,"Kg",null,null,null,null,null,null,{"$f":"AE57-AF57","v":-0.16666666666666663},null,71,80,{"$f":"IF(X57=\"\",\"Ignore\",IF(AD57=\"Injured vs Uninjured\",AC57,AC57))","v":78},null,null,null,null,null,null,null,"Joule",null,null,null,null,null,null,{"$f":"AX57-AY57","v":-0.14102564102564108},null,{"$f":"IF(AZ57=\"Pass\",AS57,\"Enter New Value\")","v":67},{"$f":"IF(AZ57=\"Pass\",AT57,\"Enter New Value\")","v":80},{"$f":"IF(X39=\"Enter New Value\",\"Ignore\",IF(AW57=\"Injured vs Uninjured\",AT57,AV57))","v":78}]
[null,null,null,null,"j",null,null,null,null,null,null,null,null,null,null,null,null,null,null,null,null,null,null,null,null,null,null,null,null,null,null,null,null,null,null,null,null,null,null,null,{"$f":"AO57","v":"Progress 2"},{"$f":"W49","v":0},{"$f":"X49","v":"u"},"Goniometre",{"$f":"AH50","v":21},{"$f":"AI50","v":22},{"$f":"AB49","v":25},{"$f":"IF(AU59>0,AU59,AT59)","v":25},{"$f":"IF(OR(AND((AT59/AV59>$J$31),AT59/AV59<$K$31),AU59=0), \"Injured vs uninjured\", \"Injured vs benchmark\")","v":"Injured vs uninjured"},{"$f":"IF(AW59=\"Injured vs Uninjured\", AS59/AT59,AS59/AV59)","v":0.95454545454545459},{"$f":"M39","v":0.9},{"$f":"IF(AX59>=85%,\"Pass\",IF(AX59<85%,\"Fail\",\"Error\"))","v":"Pass"},{"$f":"BA57","v":"Injured"},"Uninjured","Benchmark",{"$f":"IF(OR(AND((BB60/BC60>$J$31),BB60/BC60<$K$31),AV59=0), \"Injured vs uninjured\", \"Injured vs benchmark\")","v":"Injured vs benchmark"},{"$f":"IF(BD59=\"Injured vs Uninjured\", BA60/BB60,BA60/BC60)","v":0.95454545454545459},{"$f":"IF(BE59>=85%,\"Pass\",IF(AX59<85%,\"Fail\",\"Error\"))","v":"Pass"}]
[null,null,null,null,null,null,null,null,null,null,null,null,null,null,null,null,null,null,null,null,null,null,null,null,null,null,null,null,null,null,null,null,null,null,null,null,null,null,null,null,null,null,null,"Degrees",null,null,null,null,null,null,{"$f":"AX59-AY59","v":5.4545454545454564E-2},null,{"$f":"IF(AZ59=\"Pass\",AS59,\"Enter New Value\")","v":21},{"$f":"IF(AZ59=\"Pass\",AT59,\"Enter New Value\")","v":22},{"$f":"IF(X39=\"Enter New Value\",\"Ignore\",IF(AW59=\"Injured vs Uninjured\",AT59,AV59))","v":22}]
[null,null,null,null,null,null,null,null,null,null,null,null,null,null,null,null,null,null,null,null,null,null,null,null,null,null,null,null,null,null,null,null,null,null,null,null,null,null,null,null,{"$f":"AO59","v":"Progress 2"},{"$f":"W51","v":0},{"$f":"X51","v":"f"},"Goniometre",{"$f":"AH52","v":27},{"$f":"AI52","v":29},{"$f":"AB51","v":30},{"$f":"IF(AU61>0,AU61,AT61)","v":30},{"$f":"IF(OR(AND((AT61/AV61>$J$31),AT61/AV61<$K$31),AU61=0), \"Injured vs uninjured\", \"Injured vs benchmark\")","v":"Injured vs uninjured"},0.93103448275862066,{"$f":"M41","v":0.9},{"$f":"IF(AX61>=85%,\"Pass\",IF(AX61<85%,\"Fail\",\"Error\"))","v":"Pass"},{"$f":"BA59","v":"Injured"},"Uninjured","Benchmark",{"$f":"IF(OR(AND((BB62/BC62>$J$31),BB62/BC62<$K$31),AV61=0), \"Injured vs uninjured\", \"Injured vs benchmark\")","v":"Injured vs benchmark"},{"$f":"IF(BD61=\"Injured vs Uninjured\", BA62/BB62,BA62/BC62)","v":0.93103448275862066},{"$f":"IF(BE61>=85%,\"Pass\",IF(AX61<85%,\"Fail\",\"Error\"))","v":"Pass"}]
[null,null,null,null,null,null,null,null,null,null,null,null,null,null,null,null,null,null,null,null,null,null,null,null,null,null,null,null,null,null,null,null,null,null,null,null,null,null,null,null,null,null,null,"Degrees",null,null,null,null,null,null,{"$f":"AX61-AY61","v":3.1034482758620641E-2},null,{"$f":"IF(AZ61=\"Pass\",AS61,\"Enter New Value\")","v":27},{"$f":"IF(AZ61=\"Pass\",AT61,\"Enter New Value\")","v":29},{"$f":"IF(X39=\"Enter New Value\",\"Ignore\",IF(AW61=\"Injured vs Uninjured\",AT61,AV61))","v":29}]
[null,null,null,null,null,null,null,null,null,null,null,null,null,null,null,null,null,null,null,null,null,null,null,null,null,null,null,null,null,null,null,null,null,null,null,null,null,null,null,null,{"$f":"AO61","v":"Progress 2"},{"$f":"W53","v":0},{"$f":"X53","v":"g"},"MicroFit/Biofet",{"$f":"AH54","v":65},78,{"$f":"AB53","v":70},{"$f":"IF(AU63>0,AU63,AT63)","v":70},{"$f":"IF(OR(AND((AT63/AV63>$J$31),AT63/AV63<$K$31),AU63=0), \"Injured vs uninjured\", \"Injured vs benchmark\")","v":"Injured vs benchmark"},{"$f":"IF(AW63=\"Injured vs Uninjured\", AS63/AT63,AS63/AV63)","v":0.9285714285714286},{"$f":"M43","v":0.9},{"$f":"IF(AX63>=85%,\"Pass\",IF(AX63<85%,\"Fail\",\"Error\"))","v":"Pass"},{"$f":"BA61","v":"Injured"},"Uninjured","Benchmark",{"$f":"IF(OR(AND((BB64/BC64>$J$31),BB64/BC64<$K$31),AV63=0), \"Injured vs uninjured\", \"Injured vs benchmark\")","v":"Injured vs benchmark"},{"$f":"IF(BD63=\"Injured vs Uninjured\", BA64/BB64,BA64/BC64)","v":0.9285714285714286},{"$f":"IF(BE63>=85%,\"Pass\",IF(AX63<85%,\"Fail\",\"Error\"))","v":"Pass"}]
[null,null,null,null,null,null,null,null,null,null,null,null,null,null,null,null,null,null,null,null,null,null,null,null,null,null,null,null,null,null,null,null,null,null,null,null,null,null,null,null,null,null,null,"Joule",null,null,null,null,null,null,{"$f":"AX63-AY63","v":2.8571428571428581E-2},null,{"$f":"IF(AZ63=\"Pass\",AS63,\"Enter New Value\")","v":65},{"$f":"IF(AZ63=\"Pass\",AT63,\"Enter New Value\")","v":78},{"$f":"IF(X39=\"Enter New Value\",\"Ignore\",IF(AW63=\"Injured vs Uninjured\",AT63,AV63))","v":70}]
[null,null,null,null,null,null,null,null,null,null,null,null,null,null,null,null,null,null,null,null,null,null,null,null,null,null,null,null,null,null,null,null,null,null,null,null,null,null,null,null,{"$f":"AO63","v":"Progress 2"},{"$f":"W55","v":0},{"$f":"X55","v":"p"},"Step",{"$f":"AH56","v":15},15,{"$f":"AB55","v":15},{"$f":"IF(AU65>0,AU65,AT65)","v":15},{"$f":"IF(OR(AND((AT65/AV65>$J$31),AT65/AV65<$K$31),AU65=0), \"Injured vs uninjured\", \"Injured vs benchmark\")","v":"Injured vs benchmark"},1,{"$f":"M45","v":1},{"$f":"IF(AX65>=85%,\"Pass\",IF(AX65<85%,\"Fail\",\"Error\"))","v":"Pass"},{"$f":"BA63","v":"Injured"},"Uninjured","Benchmark",{"$f":"IF(OR(AND((BB66/BC66>$J$31),BB66/BC66<$K$31),AV65=0), \"Injured vs uninjured\", \"Injured vs benchmark\")","v":"Injured vs benchmark"},{"$f":"IF(BD65=\"Injured vs Uninjured\", BA66/BB66,BA66/BC66)","v":1},{"$f":"IF(BE65>=85%,\"Pass\",IF(AX65<85%,\"Fail\",\"Error\"))","v":"Pass"}]
[null,null,null,null,null,null,null,null,null,null,null,null,null,null,null,null,null,null,null,null,null,null,null,null,null,null,null,null,null,null,null,null,null,null,null,null,null,null,null,null,null,null,null,"Numeric value",null,null,null,null,null,null,{"$f":"AX65-AY65","v":0},null,{"$f":"IF(AZ65=\"pass\",AS65,\"Enter New Value\")","v":15},{"$f":"IF(AZ65=\"pass\",AT65,\"Enter New Value\")","v":15},{"$f":"IF(X39=\"Enter New Value\",\"Ignore\",IF(AW65=\"Injured vs Uninjured\",AT65,AV65))","v":15}]
[null,null,null,null,null,null,null,null,null,null,null,null,null,null,null,null,null,null,null,null,null,null,null,null,null,null,null,null,null,null,null,null,null,null,null,null,null,null,null,null,{"$f":"AO65","v":"Progress 2"},{"$f":"W57","v":0},{"$f":"X57","v":"h"},"MicroFit/Biofet",{"$f":"AH58","v":71},80,{"$f":"AB57","v":78},{"$f":"IF(AU67>0,AU67,AT67)","v":78},{"$f":"IF(OR(AND((AT67/AV67>$J$31),AT67/AV67<$K$31),AU67=0), \"Injured vs uninjured\", \"Injured vs benchmark\")","v":"Injured vs benchmark"},0.91025641025641024,{"$f":"M47","v":1},{"$f":"IF(AX67>=85%,\"Pass\",IF(AX67<85%,\"Fail\",\"Error\"))","v":"Pass"},{"$f":"BA65","v":"Injured"},"Uninjured","Benchmark",{"$f":"IF(OR(AND((BB68/BC68>$J$31),BB68/BC68<$K$31),AV67=0), \"Injured vs uninjured\", \"Injured vs benchmark\")","v":"Injured vs benchmark"},{"$f":"IF(BD67=\"Injured vs Uninjured\", BA68/BB68,BA68/BC68)","v":0.91025641025641024},{"$f":"IF(BE67>=85%,\"Pass\",IF(AX67<85%,\"Fail\",\"Error\"))","v":"Pass"}]
[null,null,null,null,null,null,null,null,null,null,null,null,null,null,null,null,null,null,null,null,null,null,null,null,null,null,null,null,null,null,null,null,null,null,null,null,null,null,null,null,null,null,null,"Kg",null,null,null,null,null,null,{"$f":"AX67-AY67","v":-8.9743589743589758E-2},null,{"$f":"IF(AZ67=\"Pass\",AS67,\"Enter New Value\")","v":71},{"$f":"IF(AZ67=\"Pass\",AT67,\"Enter New Value\")","v":80},{"$f":"IF(X39=\"Enter New Value\",\"Ignore\",IF(AW67=\"Injured vs Uninjured\",AT67,AV67))","v":78}]
[]
[]
[]
["Performance Based Outcomes Measures (PBOM)-Unilateral",null,null,null,null,null,null,null,null,null,null,null,null,null,null,null,null,null,null,null,null,null,null,null,"Performance Based Outcomes Measures (PBOM)-Unilateral"]
[null,"Musculoskeletal outcomes",null,"Equipment","Injured","Uninjured ","Bench mark",null,"Benchmark","Comparisons","Difference",null,"Target",null,null,null,null,null,null,null,null,null,null,null,"Musculoskeletal outcomes",null,"Test descriptor","Equipment","Uninjured ","Bench mark",null,"Benchmark",null,"Comparisons",null,"Difference",null,"Target"]
[null,null,null,"Metric",null,null,null,null,null,null,null,null," Performance Deficit",null,null,null,null,null,null,null,null,null,null,null,null,null,null,"Metric",null,null,null,null,null,null,null,null,null," Performance Deficit"]
["Initial Eval",{"$f":"D39","v":0},null,"PAP",{"$f":"O40","v":21},{"$f":"Q40","v":25},{"$f":"I39","v":25},{"$f":"IF(G75>0,G75,F75)","v":25},{"$f":"I39","v":25},{"$f":"IF(OR(F75/H75>$N$29,H75=0), \"Injured vs uninjured\", \"Injured vs benchmark\")","v":"Injured vs uninjured"},{"$f":"IF(J75=\"Injured vs Uninjured\", E75/F75,E75/H75)","v":0.84},null,1,null,null,null,null,null,null,null,null,null,null,null,{"$f":"A75","v":"Initial Eval"},{"$f":"B75","v":0},{"$f":"C75","v":0},{"$f":"D75","v":"PAP"},{"$f":"F75","v":25},{"$f":"G75","v":25},null,{"$f":"I75","v":25},null,"Injured vs benchmark",null,{"$f":"IF(AH75=\"Injured vs Uninjured\",#REF!/ AC75,E75/AD75)","v":0.84},null,1]
[null,null,null,"Seconds",null,null,null,null,null,null,null,null,{"$f":"K75-M75","v":-0.16000000000000003},null,null,null,null,null,null,null,null,null,null,null,null,null,null,{"$f":"D76","v":"Seconds"},null,null,null,null,null,null,null,null,null,{"$f":"AJ75-AL75","v":-0.16000000000000003}]
[{"$f":"A75","v":"Initial Eval"},{"$f":"D41","v":0},null,"MicroFit/Biofet",{"$f":"O42","v":27},{"$f":"Q42","v":30},{"$f":"I41","v":30},{"$f":"IF(G77>0,G77,F77)","v":30},{"$f":"I41","v":30},{"$f":"IF(OR(F77/H77>$N$29,H77=0), \"Injured vs uninjured\", \"Injured vs benchmark\")","v":"Injured vs uninjured"},{"$f":"IF(J77=\"Injured vs Uninjured\", E77/F77,E77/H77)","v":0.9},null,0.95,null,null,null,null,null,null,null,null,null,null,null,{"$f":"A77","v":"Initial Eval"},{"$f":"B77","v":0},{"$f":"C77","v":0},"MicroFit/Biofet",{"$f":"F77","v":30},{"$f":"G77","v":30},null,{"$f":"I77","v":30},null,"Injured vs uninjured",null,{"$f":"IF(AH77=\"Injured vs Uninjured\",#REF!/ AC77,E77/AD77)","v":{"$error":"#REF!"}},null,0.95]
[null,null,null,"Joule",null,null,null,null,null,null,null,null,{"$f":"K77-M77","v":-4.9999999999999933E-2},null,null,null,null,null,null,null,null,null,null,null,null,null,null,"Joule",null,null,null,null,null,null,null,null,null,{"$f":"AJ77-AL77","v":{"$error":"#REF!"}}]
[{"$f":"A77","v":"Initial Eval"},{"$f":"D43","v":0},null,"MicroFit/Biofet",{"$f":"O44","v":45},{"$f":"Q44","v":70},{"$f":"I43","v":0},{"$f":"IF(G79>0,G79,F79)","v":70},{"$f":"I43","v":0},{"$f":"IF(OR(F79/H79>$N$29,H79=0), \"Injured vs uninjured\", \"Injured vs benchmark\")","v":"Injured vs uninjured"},{"$f":"IF(J79=\"Injured vs Uninjured\", E79/F79,E79/H79)","v":0.6428571428571429},null,0.95,null,null,null,null,null,null,null,null,null,null,null,{"$f":"A79","v":"Initial Eval"},{"$f":"B79","v":0},{"$f":"C79","v":0},"MicroFit/Biofet",{"$f":"F79","v":70},{"$f":"G79","v":0},null,{"$f":"I79","v":0},null,"Injured vs uninjured",null,{"$f":"IF(AH79=\"Injured vs Uninjured\",#REF!/ AC79,E79/AD79)","v":{"$error":"#REF!"}},null,0.95]
[null,null,null,"Joule",null,null,null,null,null,null,null,null,{"$f":"K79-M79","v":-0.30714285714285705},null,null,null,null,null,null,null,null,null,null,null,null,null,null,"Joule",null,null,null,null,null,null,null,null,null,{"$f":"AJ79-AL79","v":{"$error":"#REF!"}}]
[{"$f":"A79","v":"Initial Eval"},{"$f":"D45","v":0},null,"MicroFit/Biofet",{"$f":"O46","v":15},{"$f":"Q46","v":15},{"$f":"I45","v":0},{"$f":"IF(G81>0,G81,F81)","v":15},{"$f":"I45","v":0},{"$f":"IF(OR(F81/H81>$N$29,H81=0), \"Injured vs uninjured\", \"Injured vs benchmark\")","v":"Injured vs uninjured"},{"$f":"IF(J81=\"Injured vs Uninjured\", E81/F81,E81/H81)","v":1},null,0.95,null,null,null,null,null,null,null,null,null,null,null,{"$f":"A81","v":"Initial Eval"},{"$f":"B81","v":0},{"$f":"C81","v":0},"MicroFit/Biofet",{"$f":"F81","v":15},{"$f":"G81","v":0},null,{"$f":"I81","v":0},null,"Injured vs uninjured",null,{"$f":"IF(AH81=\"Injured vs Uninjured\",#REF!/ AC81,E81/AD81)","v":{"$error":"#REF!"}},null,0.95]
[null,null,null,"Joule",null,null,null,null,null,null,null,null,{"$f":"K81-M81","v":5.0000000000000044E-2},null,null,null,null,null,null,null,null,null,null,null,null,null,null,"Joule",null,null,null,null,null,null,null,null,null,{"$f":"AJ81-AL81","v":{"$error":"#REF!"}}]
[{"$f":"A81","v":"Initial Eval"},{"$f":"D47","v":0},null,"MicroFit/Biofet",{"$f":"O48","v":65},{"$f":"Q48","v":78},{"$f":"I47","v":78},{"$f":"IF(G83>0,G83,F83)","v":78},{"$f":"I47","v":78},{"$f":"IF(OR(F83/H83>$N$29,H83=0), \"Injured vs uninjured\", \"Injured vs benchmark\")","v":"Injured vs uninjured"},{"$f":"IF(J83=\"Injured vs Uninjured\", E83/F83,E83/H83)","v":0.83333333333333337},null,0.95,null,null,null,null,null,null,null,null,null,null,null,{"$f":"A83","v":"Initial Eval"},{"$f":"B83","v":0},{"$f":"C83","v":0},"MicroFit/Biofet",{"$f":"F83","v":78},{"$f":"G83","v":78},null,{"$f":"I83","v":78},null,"Injured vs uninjured",null,{"$f":"IF(AH83=\"Injured vs Uninjured\",#REF!/ AC83,E83/AD83)","v":{"$error":"#REF!"}},null,0.95]
[null,null,null,"Joule",null,null,null,null,null,null,null,null,{"$f":"K83-M83","v":-0.11666666666666659},null,null,null,null,null,null,null,null,null,null,null,null,null,null,"Joule",null,null,null,null,null,null,null,null,null,{"$f":"AJ83-AL83","v":{"$error":"#REF!"}}]
[{"$f":"A83","v":"Initial Eval"},{"$f":"D49","v":0},null,"MicroFit/Biofet",{"$f":"O50","v":0},{"$f":"Q50","v":0},{"$f":"I49","v":0},{"$f":"IF(G85>0,G85,F85)","v":0},{"$f":"I49","v":0},{"$f":"IF(OR(F85/H85>$N$29,H85=0), \"Injured vs uninjured\", \"Injured vs benchmark\")","v":{"$error":"#DIV/0!"}},{"$f":"IF(J85=\"Injured vs Uninjured\", E85/F85,E85/H85)","v":{"$error":"#DIV/0!"}},null,0.95,null,null,null,null,null,null,null,null,null,null,null,{"$f":"A85","v":"Initial Eval"},{"$f":"B85","v":0},{"$f":"C85","v":0},"MicroFit/Biofet",{"$f":"F85","v":0},{"$f":"G85","v":0},null,{"$f":"I85","v":0},null,"Injured vs uninjured",null,{"$f":"IF(AH85=\"Injured vs Uninjured\",#REF!/ AC85,E85/AD85)","v":{"$error":"#REF!"}},null,0.95]
[null,null,null,"Joule",null,null,null,null,null,null,null,null,{"$f":"K85-M85","v":{"$error":"#DIV/0!"}},null,null,null,null,null,null,null,null,null,null,null,null,null,null,"Joule",null,null,null,null,null,null,null,null,null,{"$f":"AJ85-AL85","v":{"$error":"#REF!"}}]
[{"$f":"A85","v":"Initial Eval"},{"$f":"D51","v":0},null,"MicroFit/Biofet",{"$f":"O52","v":0},{"$f":"Q52","v":0},{"$f":"I51","v":0},{"$f":"IF(G87>0,G87,F87)","v":0},{"$f":"I51","v":0},{"$f":"IF(OR(F87/H87>$N$29,H87=0), \"Injured vs uninjured\", \"Injured vs benchmark\")","v":{"$error":"#DIV/0!"}},{"$f":"IF(J87=\"Injured vs Uninjured\", E87/F87,E87/H87)","v":{"$error":"#DIV/0!"}},null,0.95,null,null,null,null,null,null,null,null,null,null,null,{"$f":"A87","v":"Initial Eval"},{"$f":"B87","v":0},{"$f":"C87","v":0},"MicroFit/Biofet",{"$f":"F87","v":0},{"$f":"G87","v":0},null,{"$f":"I87","v":0},null,"Injured vs uninjured",null,{"$f":"IF(AH87=\"Injured vs Uninjured\",#REF!/ AC87,E87/AD87)","v":{"$error":"#REF!"}},null,0.95]
[null,null,null,"Joule",null,null,null,null,null,null,null,null,{"$f":"K87-M87","v":{"$error":"#DIV/0!"}},null,null,null,null,null,null,null,null,null,null,null,null,null,null,"Joule",null,null,null,null,null,null,null,null,null,{"$f":"AJ87-AL87","v":{"$error":"#REF!"}}]
[{"$f":"A87","v":"Initial Eval"},{"$f":"D53","v":0},null,"MicroFit/Biofet",{"$f":"O54","v":0},{"$f":"Q54","v":0},{"$f":"I53","v":0},{"$f":"IF(G89>0,G89,F89)","v":0},{"$f":"I53","v":0},{"$f":"IF(OR(F89/H89>$N$29,H89=0), \"Injured vs uninjured\", \"Injured vs benchmark\")","v":{"$error":"#DIV/0!"}},{"$f":"IF(J89=\"Injured vs Uninjured\", E89/F89,E89/H89)","v":{"$error":"#DIV/0!"}},null,0.95,null,null,null,null,null,null,null,null,null,null,null,{"$f":"A89","v":"Initial Eval"},{"$f":"B89","v":0},{"$f":"C89","v":0},"MicroFit/Biofet",{"$f":"F89","v":0},{"$f":"G89","v":0},null,{"$f":"I89","v":0},null,"Injured vs uninjured",null,{"$f":"IF(AH89=\"Injured vs Uninjured\",#REF!/ AC89,E89/AD89)","v":{"$error":"#REF!"}},null,0.95]
[null,null,null,"Joule",null,null,null,null,null,null,null,null,{"$f":"K89-M89","v":{"$error":"#DIV/0!"}},null,null,null,null,null,null,null,null,null,null,null,null,null,null,"Joule",null,null,null,null,null,null,null,null,null,{"$f":"AJ89-AL89","v":{"$error":"#REF!"}}]
[{"$f":"A89","v":"Initial Eval"},{"$f":"D55","v":0},null,"MicroFit/Biofet",{"$f":"O56","v":0},{"$f":"Q56","v":0},{"$f":"I55","v":0},{"$f":"IF(G91>0,G91,F91)","v":0},{"$f":"I55","v":0},{"$f":"IF(OR(F91/H91>$N$29,H91=0), \"Injured vs uninjured\", \"Injured vs benchmark\")","v":{"$error":"#DIV/0!"}},{"$f":"IF(J91=\"Injured vs Uninjured\", E91/F91,E91/H91)","v":{"$error":"#DIV/0!"}},null,0.95,null,null,null,null,null,null,null,null,null,null,null,{"$f":"A91","v":"Initial Eval"},{"$f":"B91","v":0},{"$f":"C91","v":0},"MicroFit/Biofet",{"$f":"F91","v":0},{"$f":"G91","v":0},null,{"$f":"I91","v":0},null,"Injured vs uninjured",null,{"$f":"IF(AH91=\"Injured vs Uninjured\",#REF!/ AC91,E91/AD91)","v":{"$error":"#REF!"}},null,0.95]
[null,null,null,"Joule",null,null,null,null,null,null,null,null,{"$f":"K91-M91","v":{"$error":"#DIV/0!"}},null,null,null,null,null,null,null,null,null,null,null,null,null,null,"Joule",null,null,null,null,null,null,null,null,null,{"$f":"AJ91-AL91","v":{"$error":"#REF!"}}]
[{"$f":"A91","v":"Initial Eval"},{"$f":"D57","v":0},null,"MicroFit/Biofet",{"$f":"O58","v":0},{"$f":"Q58","v":0},{"$f":"I57","v":0},{"$f":"IF(G93>0,G93,F93)","v":0},{"$f":"I57","v":0},{"$f":"IF(OR(F93/H93>$N$29,H93=0), \"Injured vs uninjured\", \"Injured vs benchmark\")","v":{"$error":"#DIV/0!"}},{"$f":"IF(J93=\"Injured vs Uninjured\", E93/F93,E93/H93)","v":{"$error":"#DIV/0!"}},null,0.95,null,null,null,null,null,null,null,null,null,null,null,{"$f":"A93","v":"Initial Eval"},{"$f":"B93","v":0},{"$f":"C93","v":0},"MicroFit/Biofet",{"$f":"F93","v":0},{"$f":"G93","v":0},null,{"$f":"I93","v":0},null,"Injured vs uninjured",null,{"$f":"IF(AH93=\"Injured vs Uninjured\",#REF!/ AC93,E93/AD93)","v":{"$error":"#REF!"}},null,0.95]
[null,null,null,"Joule",null,null,null,null,null,null,null,null,{"$f":"K93-M93","v":{"$error":"#DIV/0!"}},null,null,null,null,null,null,null,null,null,null,null,null,null,null,"Joule",null,null,null,null,null,null,null,null,null,{"$f":"AJ93-AL93","v":{"$error":"#REF!"}}]
[]
[]
[null,null,null,null,null,null,null,null,null,null,null,null,null,null,null,null,null,null,null,null,null,null,null,null,"Musculoskeletal outcomes",null,"Test descriptor","Equipment","Uninjured ","Bench mark",null,"Benchmark",null,"Comparisons",null,"Difference",null,"Target"]
[null,null,null,null,null,null,null,null,null,null,null,null,null,null,null,null,null,null,null,null,null,null,null,null,null,null,null,"Metric",null,null,null,null,null,null,null,null,null," Performance Deficit"]
[null,null,null,null,null,null,null,null,null,null,null,null,null,null,null,null,null,null,null,null,null,null,null,null,{"$f":"V39","v":"Progress 1  "},{"$f":"W39","v":0},{"$f":"X39","v":"Leg press"},{"$f":"Y39","v":"Biodex"},{"$f":"AJ40","v":200},{"$f":"AB39","v":200},null,{"$f":"IF(AD99>0,AD99,AC99)","v":200},null,{"$f":"IF(OR(#REF!/AD99>$N$29,AD99=0), \"Injured vs uninjured\", \"Injured vs benchmark\")","v":{"$error":"#REF!"}},null,{"$f":"IF(AH99=\"Injured vs Uninjured\", AC99/AD99,#REF!/AF99)","v":{"$error":"#REF!"}},null,1]
[null,null,null,null,null,null,null,null,null,null,null,null,null,null,null,null,null,null,null,null,null,null,null,null,null,null,null,{"$f":"Y40","v":"Nm"},null,null,null,null,null,null,null,null,null,{"$f":"AJ99-AL99","v":{"$error":"#REF!"}}]
[null,null,null,null,null,null,null,null,null,null,null,null,null,null,null,null,null,null,null,null,null,null,null,null,{"$f":"V41","v":"Progress 1  "},{"$f":"W41","v":0},{"$f":"X41","v":"fh"},"Biodex",{"$f":"AJ42","v":950},{"$f":"AB41","v":950},null,{"$f":"IF(AD101>0,AD101,AC101)","v":950},null,{"$f":"IF(OR(#REF!/AD101>$N$29,AD101=0), \"Injured vs uninjured\", \"Injured vs benchmark\")","v":{"$error":"#REF!"}},null,{"$f":"IF(AH101=\"Injured vs Uninjured\", AC101/AD101,#REF!/AF101)","v":{"$error":"#REF!"}},null,0.95]
[null,null,null,null,null,null,null,null,null,null,null,null,null,null,null,null,null,null,null,null,null,null,null,null,null,null,null,"Kg",null,null,null,null,null,null,null,null,null,{"$f":"AJ101-AL101","v":{"$error":"#REF!"}}]
[null,null,null,null,null,null,null,null,null,null,null,null,null,null,null,null,null,null,null,null,null,null,null,null,{"$f":"V43","v":"Progress 1  "},{"$f":"W43","v":0},{"$f":"X43","v":"fg"},"DynoMo",{"$f":"AJ44","v":100},{"$f":"AB43","v":0},null,{"$f":"IF(AD103>0,AD103,AC103)","v":100},null,{"$f":"IF(OR(#REF!/AD103>$N$29,AD103=0), \"Injured vs uninjured\", \"Injured vs benchmark\")","v":{"$error":"#REF!"}},null,{"$f":"IF(AH103=\"Injured vs Uninjured\", AC103/AD103,#REF!/AF103)","v":{"$error":"#REF!"}},null,0.95]
[null,null,null,null,null,null,null,null,null,null,null,null,null,null,null,null,null,null,null,null,null,null,null,null,null,null,null,"Joule",null,null,null,null,null,null,null,null,null,{"$f":"AJ103-AL103","v":{"$error":"#REF!"}}]
[null,null,null,null,null,null,null,null,null,null,null,null,null,null,null,null,null,null,null,null,null,null,null,null,{"$f":"V45","v":"Progress 1  "},{"$f":"W45","v":0},{"$f":"X45","v":"xgf"},"MicroFit/Biofet",{"$f":"AJ46","v":9},{"$f":"AB45","v":9},null,{"$f":"IF(AD105>0,AD105,AC105)","v":9},null,{"$f":"IF(OR(#REF!/AD105>$N$29,AD105=0), \"Injured vs uninjured\", \"Injured vs benchmark\")","v":{"$error":"#REF!"}},null,{"$f":"IF(AH105=\"Injured vs Uninjured\", AC105/AD105,#REF!/AF105)","v":{"$error":"#REF!"}},null,0.95]
[null,null,null,null,null,null,null,null,null,null,null,null,null,null,null,null,null,null,null,null,null,null,null,null,null,null,null,"Joule",null,null,null,null,null,null,null,null,null,{"$f":"AJ105-AL105","v":{"$error":"#REF!"}}]
[null,null,null,null,null,null,null,null,null,null,null,null,null,null,null,null,null,null,null,null,null,null,null,null,{"$f":"V47","v":"Progress 1  "},{"$f":"W47","v":0},{"$f":"X47","v":"aaa"},"MicroFit/Biofet",{"$f":"AJ48","v":78},{"$f":"AB47","v":0},null,{"$f":"IF(AD107>0,AD107,AC107)","v":78},null,{"$f":"IF(OR(#REF!/AD107>$N$29,AD107=0), \"Injured vs uninjured\", \"Injured vs benchmark\")","v":{"$error":"#REF!"}},null,{"$f":"IF(AH107=\"Injured vs Uninjured\", AC107/AD107,#REF!/AF107)","v":{"$error":"#REF!"}},null,0.95]
[null,null,null,null,null,null,null,null,null,null,null,null,null,null,null,null,null,null,null,null,null,null,null,null,null,null,null,"Joule",null,null,null,null,null,null,null,null,null,{"$f":"AJ107-AL107","v":{"$error":"#REF!"}}]
[null,null,null,null,null,null,null,null,null,null,null,null,null,null,null,null,null,null,null,null,null,null,null,null,{"$f":"V49","v":"Progress 1  "},{"$f":"W49","v":0},{"$f":"X49","v":"u"},"Goniometre",{"$f":"AJ50","v":25},{"$f":"AB49","v":25},null,{"$f":"IF(AD109>0,AD109,AC109)","v":25},null,{"$f":"IF(OR(#REF!/AD109>$N$29,AD109=0), \"Injured vs uninjured\", \"Injured vs benchmark\")","v":{"$error":"#REF!"}},null,{"$f":"IF(AH109=\"Injured vs Uninjured\", AC109/AD109,#REF!/AF109)","v":{"$error":"#REF!"}},null,0.95]
[null,null,null,null,null,null,null,null,null,null,null,null,null,null,null,null,null,null,null,null,null,null,null,null,null,null,null,"Degrees",null,null,null,null,null,null,null,null,null,{"$f":"AJ109-AL109","v":{"$error":"#REF!"}}]
[null,null,null,null,null,null,null,null,null,null,null,null,null,null,null,null,null,null,null,null,null,null,null,null,{"$f":"V51","v":"Progress 1  "},{"$f":"W51","v":0},{"$f":"X51","v":"f"},"Goniometre",{"$f":"AJ52","v":30},{"$f":"AB51","v":30},null,{"$f":"IF(AD111>0,AD111,AC111)","v":30},null,{"$f":"IF(OR(#REF!/AD111>$N$29,AD111=0), \"Injured vs uninjured\", \"Injured vs benchmark\")","v":{"$error":"#REF!"}},null,{"$f":"IF(AH111=\"Injured vs Uninjured\", AC111/AD111,#REF!/AF111)","v":{"$error":"#REF!"}},null,0.95]
[null,null,null,null,null,null,null,null,null,null,null,null,null,null,null,null,null,null,null,null,null,null,null,null,null,null,null,"Degrees",null,null,null,null,null,null,null,null,null,{"$f":"AJ111-AL111","v":{"$error":"#REF!"}}]
[null,null,null,null,null,null,null,null,null,null,null,null,null,null,null,null,null,null,null,null,null,null,null,null,{"$f":"V53","v":"Progress 1  "},{"$f":"W53","v":0},{"$f":"X53","v":"g"},"MicroFit/Biofet",{"$f":"AJ54","v":70},{"$f":"AB53","v":70},null,{"$f":"IF(AD113>0,AD113,AC113)","v":70},null,{"$f":"IF(OR(#REF!/AD113>$N$29,AD113=0), \"Injured vs uninjured\", \"Injured vs benchmark\")","v":{"$error":"#REF!"}},null,{"$f":"IF(AH113=\"Injured vs Uninjured\", AC113/AD113,#REF!/AF113)","v":{"$error":"#REF!"}},null,0.95]
[null,null,null,null,null,null,null,null,null,null,null,null,null,null,null,null,null,null,null,null,null,null,null,null,null,null,null,"Joule",null,null,null,null,null,null,null,null,null,{"$f":"AJ113-AL113","v":{"$error":"#REF!"}}]
[null,null,null,null,null,null,null,null,null,null,null,null,null,null,null,null,null,null,null,null,null,null,null,null,{"$f":"V55","v":"Progress 1  "},{"$f":"W55","v":0},{"$f":"X55","v":"p"},"Step",{"$f":"AJ56","v":15},{"$f":"AB55","v":15},null,{"$f":"IF(AD115>0,AD115,AC115)","v":15},null,{"$f":"IF(OR(#REF!/AD115>$N$29,AD115=0), \"Injured vs uninjured\", \"Injured vs benchmark\")","v":{"$error":"#REF!"}},null,{"$f":"IF(AH115=\"Injured vs Uninjured\", AC115/AD115,#REF!/AF115)","v":{"$error":"#REF!"}},null,0.95]
[null,null,null,null,null,null,null,null,null,null,null,null,null,null,null,null,null,null,null,null,null,null,null,null,null,null,null,"Numeric value",null,null,null,null,null,null,null,null,null,{"$f":"AJ115-AL115","v":{"$error":"#REF!"}}]
[null,null,null,null,null,null,null,null,null,null,null,null,null,null,null,null,null,null,null,null,null,null,null,null,{"$f":"V57","v":"Progress 1  "},{"$f":"W57","v":0},{"$f":"X57","v":"h"},"MicroFit/Biofet",{"$f":"AJ58","v":78},{"$f":"AB57","v":78},null,{"$f":"IF(AD117>0,AD117,AC117)","v":78},null,{"$f":"IF(OR(#REF!/AD117>$N$29,AD117=0), \"Injured vs uninjured\", \"Injured vs benchmark\")","v":{"$error":"#REF!"}},null,{"$f":"IF(AH117=\"Injured vs Uninjured\", AC117/AD117,#REF!/AF117)","v":{"$error":"#REF!"}},null,0.95]
[null,null,null,null,null,null,null,null,null,null,null,null,null,null,null,null,null,null,null,null,null,null,null,null,null,null,null,"Kg",null,null,null,null,null,null,null,null,null,{"$f":"AJ117-AL117","v":{"$error":"#REF!"}}]

{"sheet":"Input Uni-Lateral (2)","index":1,"n_rows":174,"n_cols":58,"rows_kept":174,"cut":false,"hidden":true,"merged":[[169,6,173,6],[70,0,70,1],[70,7,70,8],[37,14,37,16],[68,47,69,47],[68,48,69,48],[68,49,69,49],[66,51,67,51],[66,57,67,57],[68,40,69,40],[68,41,69,41],[68,42,69,42],[68,44,69,44],[68,45,69,45],[68,46,69,46],[64,57,65,57],[66,40,67,40],[66,41,67,41],[66,42,67,42],[66,44,67,44],[66,45,67,45],[66,46,67,46],[66,47,67,47],[66,48,67,48],[66,49,67,49],[64,47,65,47],[64,48,65,48],[64,49,65,49],[64,51,65,51],[62,51,63,51],[62,57,63,57],[64,40,65,40],[64,41,65,41],[64,42,65,42],[64,44,65,44],[64,45,65,45],[64,46,65,46],[60,57,61,57],[62,40,63,40],[62,41,63,41],[62,42,63,42],[62,44,63,44],[62,45,63,45],[62,46,63,46],[62,47,63,47],[62,48,63,48],[62,49,63,49],[60,47,61,47],[60,48,61,48],[60,49,61,49],[60,51,61,51],[58,51,59,51],[58,57,59,57],[60,40,61,40],[60,41,61,41],[60,42,61,42],[60,44,61,44],[60,45,61,45],[60,46,61,46],[56,57,57,57],[58,40,59,40],[58,41,59,41],[58,42,59,42],[58,44,59,44],[58,45,59,45],[58,46,59,46],[58,47,59,47],[58,48,59,48],[58,49,59,49],[56,47,57,47],[56,48,57,48],[56,49,57,49],[56,51,57,51],[56,42,57,42],[56,44,57,44],[56,8,57,8],[56,9,57,9],[56,10,57,10],[56,11,57,11],[56,18,57,18],[56,21,57,21],[54,49,55,49],[54,51,55,51],[54,57,55,57],[54,47,55,47],[54,48,55,48],[56,45,57,45],[56,46,57,46],[56,29,57,29],[56,30,57,30],[56,32,57,32],[56,38,57,38],[56,22,57,22],[56,23,57,23],[56,25,57,25],[56,26,57,26],[56,27,57,27],[56,28,57,28],[56,2,57,2],[56,3,57,3],[56,4,57,4],[56,6,57,6],[56,7,57,7],[54,42,55,42],[54,44,55,44],[54,45,55,45],[54,46,55,46],[54,32,55,32],[54,38,55,38],[54,25,55,25],[54,26,55,26],[54,27,55,27],[54,28,55,28],[54,29,55,29],[54,30,55,30],[54,10,55,10],[54,11,55,11],[54,18,55,18],[54,21,55,21],[54,22,55,22],[54,23,55,23],[35,39,57,39],[52,57,53,57],[54,2,55,2],[54,3,55,3],[54,4,55,4],[54,6,55,6],[54,7,55,7],[54,8,55,8],[54,9,55,9],[52,45,53,45],[52,46,53,46],[52,47,53,47],[52,48,53,48],[52,49,53,49],[52,51,53,51],[52,38,53,38],[52,42,53,42],[52,44,53,44],[52,27,53,27],[52,28,53,28],[52,29,53,29],[52,30,53,30],[52,32,53,32],[52,18,53,18],[52,21,53,21],[52,22,53,22],[52,23,53,23],[52,25,53,25],[52,26,53,26],[50,57,51,57],[52,2,53,2],[52,3,53,3],[52,4,53,4],[52,6,53,6],[52,7,53,7],[52,8,53,8],[52,9,53,9],[52,10,53,10],[52,11,53,11],[50,47,51,47],[50,48,51,48],[50,49,51,49],[50,51,51,51],[50,42,51,42],[50,44,51,44],[50,45,51,45],[50,46,51,46],[50,29,51,29],[50,30,51,30],[50,32,51,32],[50,38,51,38],[50,22,51,22],[50,23,51,23],[50,25,51,25],[50,26,51,26],[50,27,51,27],[50,28,51,28],[50,8,51,8],[50,9,51,9],[50,10,51,10],[50,11,51,11],[50,18,51,18],[50,21,51,21],[48,49,49,49],[48,51,49,51],[48,57,49,57],[50,2,51,2],[50,3,51,3],[50,4,51,4],[50,6,51,6],[50,7,51,7],[48,42,49,42],[48,44,49,44],[48,45,49,45],[48,46,49,46],[48,47,49,47],[48,48,49,48],[48,32,49,32],[48,38,49,38],[48,25,49,25],[48,26,49,26],[48,27,49,27],[48,28,49,28],[48,29,49,29],[48,30,49,30],[48,10,49,10],[48,11,49,11],[48,18,49,18],[48,21,49,21],[48,22,49,22],[48,23,49,23],[46,57,47,57],[48,2,49,2],[48,3,49,3],[48,4,49,4],[48,6,49,6],[48,7,49,7],[48,8,49,8],[48,9,49,9],[46,45,47,45],[46,46,47,46],[46,47,47,47],[46,51,47,51],[46,38,47,38],[46,42,47,42],[46,44,47,44],[46,27,47,27],[46,28,47,28],[46,29,47,29],[46,32,47,32],[46,36,47,36],[46,19,47,19],[46,22,47,22],[46,23,47,23],[46,25,47,25],[46,26,47,26],[46,9,47,9],[46,10,47,10],[46,11,47,11],[46,13,47,13],[46,17,47,17],[46,3,47,3],[46,4,47,4],[46,6,47,6],[46,7,47,7],[46,8,47,8],[44,51,45,51],[44,57,45,57],[44,42,45,42],[44,44,45,44],[44,45,45,45],[44,46,45,46],[44,47,45,47],[44,32,45,32],[44,36,45,36],[44,38,45,38],[44,23,45,23],[44,25,45,25],[44,26,45,26],[44,27,45,27],[44,28,45,28],[44,29,45,29],[44,13,45,13],[44,17,45,17],[44,19,45,19],[44,22,45,22],[42,57,43,57],[44,3,45,3],[44,4,45,4],[44,6,45,6],[44,7,45,7],[44,8,45,8],[44,9,45,9],[44,10,45,10],[44,11,45,11],[42,47,43,47],[42,51,43,51],[42,42,43,42],[42,44,43,44],[42,45,43,45],[42,46,43,46],[42,29,43,29],[42,32,43,32],[42,36,43,36],[42,38,43,38],[42,22,43,22],[42,23,43,23],[42,25,43,25],[42,26,43,26],[42,4,43,4],[42,6,43,6],[42,7,43,7],[42,8,43,8],[42,9,43,9],[42,10,43,10],[40,46,41,46],[40,47,41,47],[40,38,41,38],[40,42,41,42],[40,44,41,44],[40,45,41,45],[40,28,41,28],[40,29,41,29],[40,32,41,32],[40,25,41,25],[42,27,43,27],[40,10,41,10],[38,57,39,57],[38,51,39,51],[42,28,43,28],[42,11,43,11],[42,13,43,13],[42,17,43,17],[42,19,43,19],[40,57,41,57],[40,51,41,51],[38,19,39,19],[38,22,39,22],[38,23,39,23],[38,25,39,25],[38,26,39,26],[40,36,41,36],[40,26,41,26],[40,27,41,27],[40,11,41,11],[40,13,41,13],[40,17,41,17],[40,19,41,19],[38,45,39,45],[38,46,39,46],[38,47,39,47],[38,38,39,38],[38,42,39,42],[38,44,39,44],[38,27,39,27],[38,28,39,28],[38,29,39,29],[38,32,39,32],[38,36,39,36],[36,48,37,48],[36,49,37,49],[37,52,37,56],[38,3,39,3],[38,4,39,4],[38,6,39,6],[38,7,39,7],[38,8,39,8],[36,40,37,41],[36,42,37,42],[36,44,37,44],[36,45,37,45],[36,46,37,46],[36,47,37,47],[36,27,37,27],[36,28,37,28],[36,29,37,29],[36,30,37,30],[36,32,37,32],[36,33,37,38],[36,10,37,10],[36,11,37,11],[36,21,37,22],[36,23,37,23],[36,25,37,25],[36,26,37,26],[35,0,59,1],[35,2,35,12],[35,20,57,20],[36,2,37,3],[36,4,37,4],[36,6,37,6],[36,7,37,7],[36,8,37,8],[36,9,37,9],[38,9,39,9],[38,10,39,10],[38,11,39,11],[38,13,39,13],[38,17,39,17],[40,22,41,22],[40,23,41,23],[40,3,41,3],[40,4,41,4],[40,6,41,6],[40,7,41,7],[40,8,41,8],[40,9,41,9],[42,3,43,3],[24,2,24,3],[24,6,24,10],[24,24,24,25],[27,0,28,12],[31,0,32,20],[31,21,32,39],[22,46,22,50],[23,2,23,3],[23,6,23,10],[23,24,23,25],[23,42,23,43],[23,46,23,50],[21,22,22,23],[21,24,22,25],[21,26,21,27],[21,28,21,29],[21,30,24,32],[22,42,22,43],[20,0,20,10],[20,22,20,31],[20,40,21,41],[20,42,21,43],[20,44,20,45],[20,46,21,50],[21,0,22,1],[21,2,22,3],[21,4,21,5],[21,6,22,10],[16,0,16,1],[16,4,16,10],[16,22,16,23],[16,28,16,31],[16,44,17,50],[17,4,18,10],[17,28,19,32],[18,44,18,50],[19,4,19,10],[19,40,19,50],[14,0,14,1],[14,2,14,3],[14,22,14,23],[14,24,14,25],[14,40,14,50],[15,0,15,10],[15,22,15,31],[15,40,15,41],[15,44,15,50],[9,22,9,23],[9,24,9,25],[9,40,9,41],[9,42,9,43],[7,40,7,41],[7,42,7,43],[12,42,12,43],[13,0,13,1],[13,2,13,3],[13,22,13,23],[13,24,13,25],[13,40,13,41],[13,42,13,43],[10,0,10,1],[10,2,10,3],[10,22,10,23],[10,24,10,25],[10,40,11,41],[11,0,12,1],[11,22,12,23],[12,40,12,41],[0,0,5,7],[0,8,0,10],[5,40,5,50],[6,0,6,10],[6,40,6,41],[6,42,6,43],[6,44,6,50],[7,44,13,50],[8,0,8,1],[8,2,8,3],[8,4,14,10],[8,22,8,23],[8,24,8,25],[8,26,14,32],[8,40,8,41],[7,0,7,1],[7,2,7,3],[7,4,7,10],[7,22,7,23],[7,24,7,25],[7,26,7,32],[8,42,8,43],[9,0,9,1],[9,2,9,3]]}
["Translate research into private practice",null,null,null,null,null,null,null,"Key for colour codes"]
[null,null,null,null,null,null,null,null," Robot Colour Codes","VAS pain","Difference between injured and uninjured"]
[null,null,null,null,null,null,null,null,"Red ","6-10","0-69%"]
[null,null,null,null,null,null,null,null,"Orange ","4-6","70-85%"]
[null,null,null,null,null,null,null,null,"Green","0-3","85-100%"]
[null,null,null,null,null,null,null,null,null,null,null,null,null,null,null,null,null,null,null,null,null,null,null,null,null,null,null,null,null,null,null,null,null,null,null,null,null,null,null,null," Patient Demographics"]
[" Patient Demographics",null,null,null,null,null,null,null,null,null,null,null,null,null,null,null,null,null,null,null,null,null," Patient Demographics",null,null,null,null,null,null,null,null,null,null,null,null,null,null,null,null,null,"Initial assesment ",null,2,null," Clinical summary"]
["Initial assesment ",null,2,null," Clinical summary",null,null,null,null,null,null,null,null,null,null,null,null,null,null,null,null,null,"Initial assesment ",null,2,null," Clinical summary",null,null,null,null,null,null,null,null,null,null,null,null,null,"Date:",null,"2022-06-05",null,"JANIE HARDLOOP IN DIE PAD"]
["Date:",null,"2022-06-05",null,"JANIE HARDLOOP IN DIE PAD",null,null,null,null,null,null,null,null,null,null,null,null,null,null,null,null,null,"Date:",null,"2022-06-05",null,"JANIE HARDLOOP IN DIE PAD",null,null,null,null,null,null,null,null,null,null,null,null,null,"Name & Surname:",null,"Koos"]
["Name & Surname:",null,"Koos",null,null,null,null,null,null,null,null,null,null,null,null,null,null,null,null,null,null,null,"Name & Surname:",null,"Koos",null,null,null,null,null,null,null,null,null,null,null,null,null,null,null,"Field",null,"Orthopeadic"]
["Field",null,"Orthopeadic",null,null,null,null,null,null,null,null,null,null,null,null,null,null,null,null,null,null,null,"Field",null,"Orthopeadic",null,null,null,null,null,null,null,null,null,null,null,null,null,null,null,"Diagnose: ",null,"Primary","Secondary"]
["Diagnose: ",null,"Primary","Secondary",null,null,null,null,null,null,null,null,null,null,null,null,null,null,null,null,null,null,"Diagnose: ",null,"Primary","Secondary",null,null,null,null,null,null,null,null,null,null,null,null,null,null,null,null,"ACLR","nslbp"]
[null,null,"ACLR","nslbp",null,null,null,null,null,null,null,null,null,null,null,null,null,null,null,null,null,null,null,null,"ACLR","nslbp",null,null,null,null,null,null,null,null,null,null,null,null,null,null,"Months/weeks after injury",null,"5 months"]
["Months/weeks after injury",null,"5 months",null,null,null,null,null,null,null,null,null,null,null,null,null,null,null,null,null,null,null,"Months/weeks after injury",null,"5 months",null,null,null,null,null,null,null,null,null,null,null,null,null,null,null,"Patient Goal",null,"Performance"]
["Patient Goal",null,"Performance",null,null,null,null,null,null,null,null,null,null,null,null,null,null,null,null,null,null,null,"Patient Goal",null,"Performance",null,null,null,null,null,null,null,null,null,null,null,null,null,null,null,"Patient Reported Outcomes Measures (PROM)"]
["Patient Reported Outcomes Measures (PROM)",null,null,null,null,null,null,null,null,null,null,null,null,null,null,null,null,null,null,null,null,null,"Patient Reported Outcomes Measures (PROM)",null,null,null,null,null,null,null,null,null,null,null,null,null,null,null,null,null," Subjective Scoring Sheet",null,"Current score ","Bench mark ","Comments"]
[" Subjective Scoring Sheet",null,"Current score ","Bench mark ","Comments",null,null,null,null,null,null,null,null,null,null,null,null,null,null,null,null,null," Subjective Scoring Sheet",null,"Current Score","Initial Ass","Bench mark ","Progress","Comments",null,null,null,null,null,null,null,null,null,null,null,"Initial Eval","Ankle and Foot",0.56000000000000005,0.67,"djhgsklhfaksjdhakldhakjhdakdh"]
["Initial Eval","Ankle and Foot",0.56000000000000005,0.67,"djhgsklhfaksjdhakldhakjhdakdh",null,null,null,null,null,null,null,null,null,null,null,null,null,null,null,null,null,"Initial Eval","Ankle and Foot",0.78,0.56000000000000005,0.9,{"$f":"Y18-Z18","v":0.21999999999999997},null,null,null,null,null,null,null,null,null,null,null,null,"Initial","Oswestry Disability Index",0.44,0.78]
["Initial","Oswestry Disability Index",0.44,0.78,null,null,null,null,null,null,null,null,null,null,null,null,null,null,null,null,null,null,"Initial","Oswestry Disability Index",0.78,0.44,0.9,{"$f":"Y19-Z19","v":0.34},null,null,null,null,null,null,null,null,null,null,null,null,"Initial","Lower leg",0.67,0.89]
["Initial","Lower leg",0.67,0.89,null,null,null,null,null,null,null,null,null,null,null,null,null,null,null,null,null,null,"Initial","Lower leg",0.78,0.67,0.9,0.10999999999999999,null,null,null,null,null,null,null,null,null,null,null,null,"Patient Reported VAS Pain "]
["Patient Reported VAS Pain ",null,null,null,null,null,null,null,null,null,null,null,null,null,null,null,null,null,null,null,null,null,"Patient Reported VAS Pain ",null,null,null,null,null,null,null,null,null,null,null,null,null,null,null,null,null," Pain Outcome measure during activity or rest",null,"Location/area/referred",null,"Current",null,"Comments"]
[" Pain Outcome measure during activity or rest",null,"Location/area/referred",null,"Current",null,"Comments",null,null,null,null,null,null,null,null,null,null,null,null,null,null,null," Pain Outcome measure during activity or rest",null,"Location/area/referred",null,"Current",null,"Current",null,null,null,null,null,null,null,null,null,null,null,null,null,null,null,"Involved (/10)","Uninvolved(/10)"]
[null,null,null,null,"Involved (/10)","Uninvolved(/10)",null,null,null,null,null,null,null,null,null,null,null,null,null,null,null,null,null,null,null,null,"Involved (/10)","Uninvolved(/10)","Involved (/10)","Uninvolved(/10)",null,null,null,null,null,null,null,null,null,null,"Initial","xdfsd","d",null,3,0," Fig 1: strtwetwr"]
["Initial","xdfsd","d",null,3,0," Fig 1: strtwetwr",null,null,null,null,null,null,null,null,null,null,null,null,null,null,null,"Initial","xdfsd","d",null,3,0,2,0,null,null,null,null,null,null,null,null,null,null,"Initial","xdgdg","cfgdfg",null,4,0,"Fig 2: wtwrwrw"]
["Initial","xdgdg","cfgdfg",null,4,0,"Fig 2: wtwrwrw",null,null,null,null,null,null,null,null,null,null,null,null,null,null,null,"Initial","xdgdg","cfgdfg",null,4,0,4,0]
[]
[]
["Start at INITIAL for FIRST ASSESSMENT"]
[null,null,null,null,null,null,null,null,null,null,null,null,null,0.8]
[]
[null,null,null,null,null,null,null,null,"Factor",0.85,1]
["Move to Progress 1 if not first assessment ----> --------------------->---------------------->-------------",null,null,null,null,null,null,null,null,null,null,null,null,null,null,null,null,null,null,null,null,"Move to progress 2 if progression made for final evaluation ---->-------------->------------->"]
[]
[]
[]
["INITIAL",null,"Performance Based Outcomes Measures (PBOM)-Unilateral",null,null,null,null,null,null,null,null,null,null,null,null,null,null,null,null,null,"Progress 1",null,null,null,null,null,null,null,null,null,null,null,null,null,null,null,null,null,null,"Progress 2"]
[null,null,"Musculoskeletal outcomes",null,"Test descriptor","Equipment","Injured","Uninjured ","Bench mark","Benchmark","Comparisons","Difference","Target",null,null,null,null,null,null,null,null,"Musculoskeletal outcomes",null,"Test descriptor","Equipment","Injured","Uninjured ","Bench mark","Benchmark","Comparisons","Difference","Target","TEST 2 RESULTS","Post treatment test",null,null,null,null,null,null,"Musculoskeletal outcomes",null,"Test descriptor","Equipment","Injured","Uninjured ","Bench mark","Benchmark","Comparisons","Difference","Target"]
[null,null,null,null,null,"Metric",null,null,null,null,null,null," Performance Deficit","Test 1 Results ","Post treatment test",null,null,"Comparison","Difference",null,null,null,null,null,"Metric",null,null,null,null,null,null," Performance Deficit",null,null,null,null,null,null,null,null,null,null,null,"Metric",null,null,null,null,null,null," Performance Deficit","Test 3 Results","Post treatment test",null,null,null,null,"Test 4 results"]
[null,null,"Initial Eval","External Rot_Peak F","u","Goniometre",12,15,25,{"$f":"IF(I39>0,I39,H39)","v":25},{"$f":"IF(OR(AND((H39/J39>$J$31),H39/J39<$K$31),I39=0), \"Injured vs uninjured\", \"Injured vs benchmark\")","v":"Injured vs benchmark"},{"$f":"IF(K39=\"Injured vs uninjured\", G39/H39,G39/J39)","v":0.48},1,{"$f":"IF(L39>=85%,\"Pass\",IF(L39<85%,\"Fail\",\"Error\"))","v":"Fail"},"Injured","Uninjured","Benchmark",{"$f":"IF(OR(AND((P40/Q40>$J$31),P40/Q40<$K$31),I39=0), \"Injured vs uninjured\", \"Injured vs benchmark\")","v":"Injured vs uninjured"},{"$f":"IF(R39=\"Injured vs uninjured\", O40/P40,O40/Q40)","v":0.95454545454545459},{"$f":"IF(S39>=85%,\"Pass\",IF(S39<85%,\"Fail\",\"Error\"))","v":"Pass"},null,"Progress 1  ","GIRD_","Leg press","Biodex",125,160,200,{"$f":"IF(AB39>0,AB39,AA39)","v":200},{"$f":"IF(OR(AND((AA39/AC39>$J$31),AA39/AC39<$K$31),AB39=0), \"Injured vs uninjured\", \"Injured vs benchmark\")","v":"Injured vs benchmark"},{"$f":"IF(AD39=\"Injured vs uninjured\", Z39/AA39,Z39/AC39)","v":0.625},1,{"$f":"IF(AE39>=85%,\"Pass\",IF(AE39<85%,\"Fail\",\"Error\"))","v":"Fail"},"Injured","Uninjured","Benchmark",{"$f":"IF(OR(AND((AI40/AJ40>$J$31),AI40/AJ40<$K$31),AC39=0), \"Injured vs uninjured\", \"Injured vs benchmark\")","v":"Injured vs uninjured"},{"$f":"IF(AK39=\"Injured vs Uninjured\", AH40/AI40,AH40/AC39)","v":0.8146067415730337},{"$f":"IF(AL39>=85%,\"Pass\",IF(AL39<85%,\"Fail\",\"Error\"))","v":"Fail"},null,"Discharge","RSI","fsd","Stopwatch",17,24,34,{"$f":"IF(AU39>0,AU39,AT39)","v":34},{"$f":"IF(OR(AND((AT39/AV39>$J$31),AT39/AV39<$K$31),AU39=0), \"Injured vs uninjured\", \"Injured vs benchmark\")","v":"Injured vs benchmark"},{"$f":"IF(AW39=\"Injured vs Uninjured\", AS39/AT39,AS39/AV39)","v":0.5},1,{"$f":"IF(AX39>=85%,\"Pass\",IF(AX39<85%,\"Fail\",\"Error\"))","v":"Fail"},"Injured","Uninjured","Benchmark",{"$f":"IF(OR(AND((BB40/BC40>$J$31),BB40/BC40<$K$31),AV39=0), \"Injured vs uninjured\", \"Injured vs benchmark\")","v":"Injured vs uninjured"},{"$f":"IF(BD39=\"Injured vs Uninjured\", BA40/BB40,BA40/BC40)","v":0.9},{"$f":"IF(BE39>=85%,\"Pass\",IF(AX39<85%,\"Fail\",\"Error\"))","v":"Pass"}]
[null,null,null,null,null,"Degrees",null,null,null,null,null,null,{"$f":"L39-M39","v":-0.52},null,21,22,{"$f":"IF(E39=\"\",\"Ignore\",IF(K39=\"Injured vs Uninjured\",J39,J39))","v":25},null,null,null,null,null,null,null,"Nm",null,null,null,null,null,null,{"$f":"AE39-AF39","v":-0.375},null,145,178,{"$f":"IF(X39=\"\",\"Ignore\",IF(AD39=\"Injured vs Uninjured\",AC39,AC39))","v":200},null,null,null,null,null,null,null,"Seconds",null,null,null,null,null,null,{"$f":"AX39-AY39","v":-0.5},null,27,30,{"$f":"IF(X39=\"Enter New Value\",\"Ignore\",IF(AW39=\"Injured vs Uninjured\",AT39,AV39))","v":34}]
[null,null,{"$f":"C39","v":"Initial Eval"},"Hamstring- Strenth End","f","Goniometre",20,20,30,{"$f":"IF(I41>0,I41,H41)","v":30},{"$f":"IF(OR(AND((H41/J41>$J$31),H41/J41<$K$31),I41=0), \"Injured vs uninjured\", \"Injured vs benchmark\")","v":"Injured vs benchmark"},{"$f":"IF(K41=\"Injured vs uninjured\", G41/H41,G41/J41)","v":0.66666666666666663},0.9,{"$f":"IF(L41>=85%,\"Pass\",IF(L41<85%,\"Fail\",\"Error\"))","v":"Fail"},{"$f":"O39","v":"Injured"},{"$f":"P39","v":"Uninjured"},{"$f":"Q39","v":"Benchmark"},{"$f":"IF(OR(AND((P42/Q42>$J$31),P42/Q42<$K$31),I41=0), \"Injured vs uninjured\", \"Injured vs benchmark\")","v":"Injured vs uninjured"},{"$f":"IF(R41=\"Injured vs uninjured\", O42/P42,O42/Q42)","v":0.93103448275862066},{"$f":"IF(S41>=85%,\"Pass\",IF(S41<85%,\"Fail\",\"Error\"))","v":"Pass"},null,{"$f":"V39","v":"Progress 1  "},"PGM- Strength end","fh","Biodex",400,780,950,{"$f":"IF(AB41>0,AB41,AA41)","v":950},{"$f":"IF(OR(AND((AA41/AC41>$J$31),AA41/AC41<$K$31),AB41=0), \"Injured vs uninjured\", \"Injured vs benchmark\")","v":"Injured vs benchmark"},{"$f":"IF(AD41=\"Injured vs uninjured\", Z41/AA41,Z41/AC41)","v":0.42105263157894735},1,{"$f":"IF(AE41>=85%,\"Pass\",IF(AE41<85%,\"Fail\",\"Error\"))","v":"Fail"},"Injured",{"$f":"AI39","v":"Uninjured"},{"$f":"AJ39","v":"Benchmark"},{"$f":"IF(OR(AND((AI42/AJ42>$J$31),AI42/AJ42<$K$31),AC41=0), \"Injured vs uninjured\", \"Injured vs benchmark\")","v":"Injured vs uninjured"},{"$f":"IF(AK41=\"Injured vs Uninjured\", AH42/AI42,AH42/AC41)","v":0.61604938271604937},{"$f":"IF(AL41>=85%,\"Pass\",IF(AL41<85%,\"Fail\",\"Error\"))","v":"Fail"},null,"Discharge","DSI","sdfsf","Stopwatch",45,89,120,{"$f":"IF(AU41>0,AU41,AT41)","v":120},{"$f":"IF(OR(AND((AT41/AV41>$J$31),AT41/AV41<$K$31),AU41=0), \"Injured vs uninjured\", \"Injured vs benchmark\")","v":"Injured vs benchmark"},{"$f":"IF(AW41=\"Injured vs Uninjured\", AS41/AT41,AS41/AV41)","v":0.375},0.95,{"$f":"IF(AX41>=85%,\"Pass\",IF(AX41<85%,\"Fail\",\"Error\"))","v":"Fail"},{"$f":"BA39","v":"Injured"},{"$f":"BB39","v":"Uninjured"},{"$f":"BC39","v":"Benchmark"},{"$f":"IF(OR(AND((BB42/BC42>$J$31),BB42/BC42<$K$31),AV41=0), \"Injured vs uninjured\", \"Injured vs benchmark\")","v":"Injured vs benchmark"},{"$f":"IF(BD41=\"Injured vs Uninjured\", BA42/BB42,BA42/BC42)","v":0.55833333333333335},{"$f":"IF(BE41>=85%,\"Pass\",IF(AX41<85%,\"Fail\",\"Error\"))","v":"Fail"}]
[null,null,null,null,null,"Degrees",null,null,null,null,null,null,{"$f":"L41-M41","v":-0.23333333333333339},null,27,29,{"$f":"IF(E41=\"\",\"Ignore\",IF(K41=\"Injured vs Uninjured\",J41,J41))","v":30},null,null,null,null,null,null,null,"Kg",null,null,null,null,null,null,{"$f":"AE41-AF41","v":-0.57894736842105265},null,499,810,{"$f":"IF(X41=\"\",\"Ignore\",IF(AD41=\"Injured vs Uninjured\",AC41,AC41))","v":950},null,null,null,null,null,null,null,"Joule",null,null,null,null,null,null,{"$f":"AX41-AY41","v":-0.57499999999999996},null,67,98,{"$f":"IF(X39=\"Enter New Value\",\"Ignore\",IF(AW41=\"Injured vs Uninjured\",AT41,AV41))","v":120}]
[null,null,{"$f":"C41","v":"Initial Eval"},"Quadriceps- PF","g","MicroFit/Biofet",40,70,0,{"$f":"IF(I43>0,I43,H43)","v":70},{"$f":"IF(OR(AND((H43/J43>$J$31),H43/J43<$K$31),I43=0), \"Injured vs uninjured\", \"Injured vs benchmark\")","v":"Injured vs uninjured"},{"$f":"IF(K43=\"Injured vs uninjured\", G43/H43,G43/J43)","v":0.5714285714285714},0.9,{"$f":"IF(L43>=85%,\"Pass\",IF(L43<85%,\"Fail\",\"Error\"))","v":"Fail"},{"$f":"O41","v":"Injured"},"Uninjured",{"$f":"Q41","v":"Benchmark"},{"$f":"IF(OR(AND((P44/Q44>$J$31),P44/Q44<$K$31),I43=0), \"Injured vs uninjured\", \"Injured vs benchmark\")","v":"Injured vs uninjured"},{"$f":"IF(R43=\"Injured vs uninjured\", O44/P44,O44/Q44)","v":0.67164179104477617},{"$f":"IF(S43>=85%,\"Pass\",IF(S43<85%,\"Fail\",\"Error\"))","v":"Fail"},null,{"$f":"V41","v":"Progress 1  "},"Glut Max_ ","fg","DynoMo",60,100,0,{"$f":"IF(AB43>0,AB43,AA43)","v":100},{"$f":"IF(OR(AND((AA43/AC43>$J$31),AA43/AC43<$K$31),AB43=0), \"Injured vs uninjured\", \"Injured vs benchmark\")","v":"Injured vs uninjured"},{"$f":"IF(AD43=\"Injured vs uninjured\", Z43/AA43,Z43/AC43)","v":0.6},1,{"$f":"IF(AE43>=85%,\"Pass\",IF(AE43<85%,\"Fail\",\"Error\"))","v":"Fail"},"Injured",{"$f":"AI41","v":"Uninjured"},{"$f":"AJ41","v":"Benchmark"},{"$f":"IF(OR(AND((AI44/AJ44>$J$31),AI44/AJ44<$K$31),AC43=0), \"Injured vs uninjured\", \"Injured vs benchmark\")","v":"Injured vs uninjured"},{"$f":"IF(AK43=\"Injured vs Uninjured\", AH44/AI44,AH44/AC43)","v":0.86206896551724133},{"$f":"IF(AL43>=85%,\"Pass\",IF(AL43<85%,\"Fail\",\"Error\"))","v":"Pass"},null,"Discharge","PSI","fss","MicroFit/Biofet",67,78,100,{"$f":"IF(AU43>0,AU43,AT43)","v":100},{"$f":"IF(OR(AND((AT43/AV43>$J$31),AT43/AV43<$K$31),AU43=0), \"Injured vs uninjured\", \"Injured vs benchmark\")","v":"Injured vs benchmark"},{"$f":"IF(AW43=\"Injured vs Uninjured\", AS43/AT43,AS43/AV43)","v":0.67},0.95,{"$f":"IF(AX43>=85%,\"Pass\",IF(AX43<85%,\"Fail\",\"Error\"))","v":"Fail"},{"$f":"BA41","v":"Injured"},"Uninjured","Benchmark",{"$f":"IF(OR(AND((BB44/BC44>$J$31),BB44/BC44<$K$31),AV43=0), \"Injured vs uninjured\", \"Injured vs benchmark\")","v":"Injured vs benchmark"},{"$f":"IF(BD43=\"Injured vs Uninjured\", BA44/BB44,BA44/BC44)","v":0.89},{"$f":"IF(BE43>=85%,\"Pass\",IF(AX43<85%,\"Fail\",\"Error\"))","v":"Pass"}]
[null,null,null,null,null,"Joule",null,null,null,null,null,null,{"$f":"L43-M43","v":-0.32857142857142863},null,45,67,{"$f":"IF(E43=\"\",\"Ignore\",IF(K43=\"Injured vs Uninjured\",J43,J43))","v":70},null,null,null,null,null,null,null,"Joule",null,null,null,null,null,null,{"$f":"AE43-AF43","v":-0.4},null,75,87,{"$f":"IF(X43=\"\",\"Ignore\",IF(AD43=\"Injured vs Uninjured\",AC43,AC43))","v":100},null,null,null,null,null,null,null,"Joule",null,null,null,null,null,null,{"$f":"AX43-AY43","v":-0.27999999999999992},null,89,78,{"$f":"IF(X39=\"Enter New Value\",\"Ignore\",IF(AW43=\"Injured vs Uninjured\",AT43,AV43))","v":100}]
[null,null,{"$f":"C43","v":"Initial Eval"},"Ankle_ ROM","p","Step",10,20,0,{"$f":"IF(I45>0,I45,H45)","v":20},{"$f":"IF(OR(AND((H45/J45>$J$31),H45/J45<$K$31),I45=0), \"Injured vs uninjured\", \"Injured vs benchmark\")","v":"Injured vs uninjured"},{"$f":"IF(K45=\"Injured vs uninjured\", G45/H45,G45/J45)","v":0.5},1,{"$f":"IF(L45>=85%,\"Pass\",IF(L45<85%,\"Fail\",\"Error\"))","v":"Fail"},{"$f":"O43","v":"Injured"},"Uninjured","Benchmark",{"$f":"IF(OR(AND((P46/Q46>$J$31),P46/Q46<$K$31),I45=0), \"Injured vs uninjured\", \"Injured vs benchmark\")","v":"Injured vs uninjured"},{"$f":"IF(R45=\"Injured vs uninjured\", O46/P46,O46/Q46)","v":0.78947368421052633},{"$f":"IF(S45>=85%,\"Pass\",IF(S45<85%,\"Fail\",\"Error\"))","v":"Fail"},null,{"$f":"V43","v":"Progress 1  "},"Hamstring- Strenth End","xgf","MicroFit/Biofet",5,7,9,{"$f":"IF(AB45>0,AB45,AA45)","v":9},{"$f":"IF(OR(AND((AA45/AC45>$J$31),AA45/AC45<$K$31),AB45=0), \"Injured vs uninjured\", \"Injured vs benchmark\")","v":"Injured vs benchmark"},{"$f":"IF(AD45=\"Injured vs uninjured\", Z45/AA45,Z45/AC45)","v":0.55555555555555558},1,{"$f":"IF(AE45>=85%,\"Pass\",IF(AE45<85%,\"Fail\",\"Error\"))","v":"Fail"},"Injured",{"$f":"AI41","v":"Uninjured"},{"$f":"AJ43","v":"Benchmark"},{"$f":"IF(OR(AND((AI46/AJ46>$J$31),AI46/AJ46<$K$31),AC45=0), \"Injured vs uninjured\", \"Injured vs benchmark\")","v":"Injured vs benchmark"},{"$f":"IF(AK45=\"Injured vs Uninjured\", AH46/AI46,AH46/AC45)","v":0.88888888888888884},{"$f":"IF(AL45>=85%,\"Pass\",IF(AL45<85%,\"Fail\",\"Error\"))","v":"Pass"},null,"Discharge","LSI","sf","MicroFit/Biofet",5,8,10,{"$f":"IF(AU45>0,AU45,AT45)","v":10},{"$f":"IF(OR(AND((AT45/AV45>$J$31),AT45/AV45<$K$31),AU45=0), \"Injured vs uninjured\", \"Injured vs benchmark\")","v":"Injured vs benchmark"},{"$f":"IF(AW45=\"Injured vs Uninjured\", AS45/AT45,AS45/AV45)","v":0.5},0.95,{"$f":"IF(AX45>=85%,\"Pass\",IF(AX45<85%,\"Fail\",\"Error\"))","v":"Fail"},{"$f":"BA43","v":"Injured"},"Uninjured","Benchmark",{"$f":"IF(OR(AND((BB46/BC46>$J$31),BB46/BC46<$K$31),AV45=0), \"Injured vs uninjured\", \"Injured vs benchmark\")","v":"Injured vs uninjured"},{"$f":"IF(BD45=\"Injured vs Uninjured\", BA46/BB46,BA46/BC46)","v":0.88888888888888884},{"$f":"IF(BE45>=85%,\"Pass\",IF(AX45<85%,\"Fail\",\"Error\"))","v":"Pass"}]
[null,null,null,null,null,"Numeric value",null,null,null,null,null,null,{"$f":"L45-M45","v":-0.5},null,15,19,{"$f":"IF(E45=\"\",\"Ignore\",IF(K45=\"Injured vs Uninjured\",H45,I45))","v":20},null,null,null,null,null,null,null,"Joule",null,null,null,null,null,null,{"$f":"AE45-AF45","v":-0.44444444444444442},null,8,9,{"$f":"IF(X45=\"\",\"Ignore\",IF(AD45=\"Injured vs Uninjured\",AC45,AC45))","v":9},null,null,null,null,null,null,null,"Joule",null,null,null,null,null,null,{"$f":"AX45-AY45","v":-0.44999999999999996},null,8,9,{"$f":"IF(X39=\"Enter New Value\",\"Ignore\",IF(AW45=\"Injured vs Uninjured\",AT45,AV45))","v":10}]
[null,null,{"$f":"C45","v":"Initial Eval"},"QASLS","h","MicroFit/Biofet",30,65,70,{"$f":"IF(I47>0,I47,H47)","v":70},{"$f":"IF(OR(AND((H47/J47>$J$31),H47/J47<$K$31),I47=0), \"Injured vs uninjured\", \"Injured vs benchmark\")","v":"Injured vs uninjured"},{"$f":"IF(K47=\"Injured vs uninjured\", G47/H47,G47/J47)","v":0.46153846153846156},1,{"$f":"IF(L47>=85%,\"Pass\",IF(L47<85%,\"Fail\",\"Error\"))","v":"Fail"},{"$f":"O45","v":"Injured"},"Uninjured","Benchmark","Injured vs uninjured",{"$f":"IF(R47=\"Injured vs uninjured\", O48/P48,O48/Q48)","v":0.98484848484848486},{"$f":"IF(S47>=85%,\"Pass\",IF(S47<85%,\"Fail\",\"Error\"))","v":"Pass"},null,{"$f":"V45","v":"Progress 1  "},"Nec  rot","aaa","MicroFit/Biofet",45,78,0,{"$f":"IF(AB47>0,AB47,AA47)","v":78},{"$f":"IF(OR(AND((AA47/AC47>$J$31),AA47/AC47<$K$31),AB47=0), \"Injured vs uninjured\", \"Injured vs benchmark\")","v":"Injured vs uninjured"},{"$f":"IF(AD47=\"Injured vs uninjured\", Z47/AA47,Z47/AC47)","v":0.57692307692307687},1,{"$f":"IF(AE47>=85%,\"Pass\",IF(AE47<85%,\"Fail\",\"Error\"))","v":"Fail"},"Injured",{"$f":"AI45","v":"Uninjured"},{"$f":"AJ45","v":"Benchmark"},{"$f":"IF(OR(AND((AI48/AJ48>$J$31),AI48/AJ48<$K$31),AC47=0), \"Injured vs uninjured\", \"Injured vs benchmark\")","v":"Injured vs benchmark"},{"$f":"IF(AK47=\"Injured vs Uninjured\", AH48/AI48,AH48/AC47)","v":0.85897435897435892},{"$f":"IF(AL47>=85%,\"Pass\",IF(AL47<85%,\"Fail\",\"Error\"))","v":"Pass"},null,"Discharge","BMP","sfs","MicroFit/Biofet",555,666,1000,{"$f":"IF(AU47>0,AU47,AT47)","v":1000},{"$f":"IF(OR(AND((AT47/AV47>$J$31),AT47/AV47<$K$31),AU47=0), \"Injured vs uninjured\", \"Injured vs benchmark\")","v":"Injured vs benchmark"},{"$f":"IF(AW47=\"Injured vs Uninjured\", AS47/AT47,AS47/AV47)","v":0.55500000000000005},0.95,{"$f":"IF(AX47>=85%,\"Pass\",IF(AX47<85%,\"Fail\",\"Error\"))","v":"Fail"},{"$f":"BA45","v":"Injured"},"Uninjured","Benchmark",{"$f":"IF(OR(AND((BB48/BC48>$J$31),BB48/BC48<$K$31),AV47=0), \"Injured vs uninjured\", \"Injured vs benchmark\")","v":"Injured vs uninjured"},{"$f":"IF(BD47=\"Injured vs Uninjured\", BA48/BB48,BA48/BC48)","v":0.875},{"$f":"IF(BE47>=85%,\"Pass\",IF(AX47<85%,\"Fail\",\"Error\"))","v":"Pass"}]
[null,null,null,null,null,"Kg",null,null,null,null,null,null,{"$f":"L47-M47","v":-0.53846153846153844},null,65,66,{"$f":"IF(E47=\"\",\"Ignore\",IF(K47=\"Injured vs Uninjured\",J47,J47))","v":70},null,null,null,null,null,null,null,"Joule",null,null,null,null,null,null,{"$f":"AE47-AF47","v":-0.42307692307692313},null,67,80,{"$f":"IF(X47=\"\",\"Ignore\",IF(AD47=\"Injured vs Uninjured\",AC47,AC47))","v":78},null,null,null,null,null,null,null,"Joule",null,null,null,null,null,null,{"$f":"AX47-AY47","v":-0.39499999999999991},null,777,888,{"$f":"IF(X39=\"Enter New Value\",\"Ignore\",IF(AW47=\"Injured vs Uninjured\",AT47,AV47))","v":1000}]
[null,null,{"$f":"C47","v":"Initial Eval"},null,null,"MicroFit/Biofet",null,null,null,{"$f":"IF(I49>0,I49,H49)","v":0},{"$f":"#REF!","v":{"$error":"#REF!"}},{"$f":"#REF!","v":{"$error":"#REF!"}},0.95,null,"Injured",null,"Uninjured",null,{"$f":"#REF!","v":{"$error":"#REF!"}},null,null,{"$f":"V47","v":"Progress 1  "},{"$f":"D39","v":"External Rot_Peak F"},{"$f":"E39","v":"u"},{"$f":"F39","v":"Goniometre"},{"$f":"O40","v":21},{"$f":"P40","v":22},{"$f":"J39","v":25},{"$f":"IF(AB49>0,AB49,AA49)","v":25},{"$f":"IF(OR(AND((AA49/AC49>$J$31),AA49/AC49<$K$31),AB49=0), \"Injured vs uninjured\", \"Injured vs benchmark\")","v":"Injured vs uninjured"},{"$f":"IF(AD49=\"Injured vs uninjured\", Z49/AA49,Z49/AC49)","v":0.95454545454545459},{"$f":"M39","v":1},{"$f":"IF(AE49>=85%,\"Pass\",IF(AE49<85%,\"Fail\",\"Error\"))","v":"Pass"},{"$f":"AH47","v":"Injured"},{"$f":"AI47","v":"Uninjured"},{"$f":"AJ47","v":"Benchmark"},{"$f":"IF(OR(AND((AI50/AJ50>$J$31),AI50/AJ50<$K$31),AC49=0), \"Injured vs uninjured\", \"Injured vs benchmark\")","v":"Injured vs uninjured"},{"$f":"IF(AK49=\"Injured vs Uninjured\", AH50/AI50,AH50/AC49)","v":0.95454545454545459},{"$f":"IF(AL49>=85%,\"Pass\",IF(AL49<85%,\"Fail\",\"Error\"))","v":"Pass"},null,"Progress 2",{"$f":"W39","v":"GIRD_"},{"$f":"X39","v":"Leg press"},{"$f":"Y39","v":"Biodex"},{"$f":"AH40","v":145},{"$f":"AI40","v":178},{"$f":"AC39","v":200},{"$f":"IF(AU49>0,AU49,AT49)","v":200},{"$f":"IF(OR(AND((AT49/AV49>$J$31),AT49/AV49<$K$31),AU49=0), \"Injured vs uninjured\", \"Injured vs benchmark\")","v":"Injured vs uninjured"},{"$f":"IF(AW49=\"Injured vs Uninjured\", AS49/AT49,AS49/AV49)","v":0.8146067415730337},{"$f":"AF39","v":1},{"$f":"IF(AX49>=85%,\"Pass\",IF(AX49<85%,\"Fail\",\"Error\"))","v":"Fail"},{"$f":"BA47","v":"Injured"},"Uninjured","Benchmark",{"$f":"IF(OR(AND((BB50/BC50>$J$31),BB50/BC50<$K$31),AV49=0), \"Injured vs uninjured\", \"Injured vs benchmark\")","v":"Injured vs benchmark"},{"$f":"IF(BD49=\"Injured vs Uninjured\", BA50/BB50,BA50/BC50)","v":1},{"$f":"IF(BE49>=85%,\"Pass\",IF(AX49<85%,\"Fail\",\"Error\"))","v":"Pass"}]
[null,null,null,null,null,"Joule",null,null,null,null,null,null,{"$f":"L49-M49","v":{"$error":"#REF!"}},null,null,null,null,null,null,null,null,null,null,null,{"$f":"F40","v":"Degrees"},null,null,null,null,null,null,{"$f":"AE49-AF49","v":-4.5454545454545414E-2},null,{"$f":"IF(AG49=\"pass\",Z49,\"Enter New Value\")","v":21},{"$f":"IF(AG49=\"pass\",AA49,\"Enter New Value\")","v":22},{"$f":"IF(X49=\"\",\"Ignore\",IF(AD49=\"Injured vs Uninjured\",AC49,AC49))","v":25},null,null,null,null,null,null,null,{"$f":"Y40","v":"Nm"},null,null,null,null,null,null,{"$f":"AX49-AY49","v":-0.1853932584269663},null,178,178,{"$f":"IF(X39=\"Enter New Value\",\"Ignore\",IF(AW49=\"Injured vs Uninjured\",AT49,AV49))","v":178}]
[null,null,{"$f":"C49","v":"Initial Eval"},null,null,"MicroFit/Biofet",null,null,null,{"$f":"IF(I51>0,I51,H51)","v":0},{"$f":"#REF!","v":{"$error":"#REF!"}},{"$f":"#REF!","v":{"$error":"#REF!"}},0.95,null,"Injured",null,"Uninjured",null,{"$f":"#REF!","v":{"$error":"#REF!"}},null,null,{"$f":"V49","v":"Progress 1  "},{"$f":"D41","v":"Hamstring- Strenth End"},{"$f":"E41","v":"f"},"Goniometre",{"$f":"O42","v":27},29,{"$f":"J41","v":30},{"$f":"IF(AB51>0,AB51,AA51)","v":30},{"$f":"IF(OR(AND((AA51/AC51>$J$31),AA51/AC51<$K$31),AB51=0), \"Injured vs uninjured\", \"Injured vs benchmark\")","v":"Injured vs uninjured"},{"$f":"IF(AD51=\"Injured vs uninjured\", Z51/AA51,Z51/AC51)","v":0.93103448275862066},{"$f":"M41","v":0.9},{"$f":"IF(AE51>=85%,\"Pass\",IF(AE51<85%,\"Fail\",\"Error\"))","v":"Pass"},{"$f":"AH49","v":"Injured"},"Uninjured","Benchmark",{"$f":"IF(OR(AND((AI52/AJ52>$J$31),AI52/AJ52<$K$31),AC51=0), \"Injured vs uninjured\", \"Injured vs benchmark\")","v":"Injured vs uninjured"},{"$f":"IF(AK51=\"Injured vs Uninjured\", AH52/AI52,AH52/AC51)","v":0.93103448275862066},{"$f":"IF(AL51>=85%,\"Pass\",IF(AL51<85%,\"Fail\",\"Error\"))","v":"Pass"},null,"Progress 2",{"$f":"W41","v":"PGM- Strength end"},{"$f":"X41","v":"fh"},"Biodex",{"$f":"AH42","v":499},{"$f":"AI42","v":810},{"$f":"AC41","v":950},{"$f":"IF(AU51>0,AU51,AT51)","v":950},{"$f":"IF(OR(AND((AT51/AV51>$J$31),AT51/AV51<$K$31),AU51=0), \"Injured vs uninjured\", \"Injured vs benchmark\")","v":"Injured vs uninjured"},{"$f":"IF(AW51=\"Injured vs Uninjured\", AS51/AT51,AS51/AV51)","v":0.61604938271604937},{"$f":"AF41","v":1},{"$f":"IF(AX51>=85%,\"Pass\",IF(AX51<85%,\"Fail\",\"Error\"))","v":"Fail"},{"$f":"BA49","v":"Injured"},"Uninjured","Benchmark",{"$f":"IF(OR(AND((BB52/BC52>$J$31),BB52/BC52<$K$31),AV51=0), \"Injured vs uninjured\", \"Injured vs benchmark\")","v":"Injured vs benchmark"},{"$f":"IF(BD51=\"Injured vs Uninjured\", BA52/BB52,BA52/BC52)","v":0.86172839506172838},{"$f":"IF(BE51>=85%,\"Pass\",IF(AX51<85%,\"Fail\",\"Error\"))","v":"Pass"}]
[null,null,null,null,null,"Joule",null,null,null,null,null,null,{"$f":"L51-M51","v":{"$error":"#REF!"}},null,null,null,null,{"$f":"56/78","v":0.71794871794871795},null,null,null,null,null,null,"Degrees",null,null,null,null,null,null,{"$f":"AE51-AF51","v":3.1034482758620641E-2},null,{"$f":"IF(AG51=\"pass\",Z51,\"Enter New Value\")","v":27},{"$f":"IF(AG51=\"pass\",AA51,\"Enter New Value\")","v":29},{"$f":"IF(X51=\"\",\"Ignore\",IF(AD51=\"Injured vs Uninjured\",AC51,AC51))","v":30},null,null,null,null,null,null,null,"Kg",null,null,null,null,null,null,{"$f":"AX51-AY51","v":-0.38395061728395063},null,698,900,{"$f":"IF(X39=\"Enter New Value\",\"Ignore\",IF(AW51=\"Injured vs Uninjured\",AT51,AV51))","v":810}]
[null,null,{"$f":"C51","v":"Initial Eval"},null,null,"MicroFit/Biofet",null,null,null,{"$f":"IF(I53>0,I53,H53)","v":0},{"$f":"#REF!","v":{"$error":"#REF!"}},{"$f":"#REF!","v":{"$error":"#REF!"}},0.95,null,"Injured",null,"Uninjured",null,{"$f":"#REF!","v":{"$error":"#REF!"}},null,null,{"$f":"V51","v":"Progress 1  "},{"$f":"D43","v":"Quadriceps- PF"},{"$f":"E43","v":"g"},"MicroFit/Biofet",{"$f":"O44","v":45},67,{"$f":"J43","v":70},{"$f":"IF(AB53>0,AB53,AA53)","v":70},{"$f":"IF(OR(AND((AA53/AC53>$J$31),AA53/AC53<$K$31),AB53=0), \"Injured vs uninjured\", \"Injured vs benchmark\")","v":"Injured vs uninjured"},{"$f":"IF(AD53=\"Injured vs uninjured\", Z53/AA53,Z53/AC53)","v":0.67164179104477617},{"$f":"M43","v":0.9},{"$f":"IF(AE53>=85%,\"Pass\",IF(AE53<85%,\"Fail\",\"Error\"))","v":"Fail"},{"$f":"AH51","v":"Injured"},"Uninjured","Benchmark",{"$f":"IF(OR(AND((AI54/AJ54>$J$31),AI54/AJ54<$K$31),AC53=0), \"Injured vs uninjured\", \"Injured vs benchmark\")","v":"Injured vs benchmark"},{"$f":"IF(AK53=\"Injured vs Uninjured\", AH54/AI54,AH54/AC53)","v":0.9285714285714286},{"$f":"IF(AL53>=85%,\"Pass\",IF(AL53<85%,\"Fail\",\"Error\"))","v":"Pass"},null,"Progress 2",{"$f":"W43","v":"Glut Max_ "},{"$f":"X43","v":"fg"},"DynoMo",{"$f":"AH44","v":75},{"$f":"AI44","v":87},{"$f":"AC43","v":100},{"$f":"IF(AU53>0,AU53,AT53)","v":100},{"$f":"IF(OR(AND((AT53/AV53>$J$31),AT53/AV53<$K$31),AU53=0), \"Injured vs uninjured\", \"Injured vs benchmark\")","v":"Injured vs uninjured"},{"$f":"IF(AW53=\"Injured vs Uninjured\", AS53/AT53,AS53/AV53)","v":0.86206896551724133},{"$f":"AF43","v":1},{"$f":"IF(AX53>=85%,\"Pass\",IF(AX53<85%,\"Fail\",\"Error\"))","v":"Pass"},{"$f":"BA51","v":"Injured"},"Uninjured","Benchmark",{"$f":"IF(OR(AND((BB54/BC54>$J$31),BB54/BC54<$K$31),AV53=0), \"Injured vs uninjured\", \"Injured vs benchmark\")","v":"Injured vs benchmark"},{"$f":"IF(BD53=\"Injured vs Uninjured\", BA54/BB54,BA54/BC54)","v":0.86206896551724133},{"$f":"IF(BE53>=85%,\"Pass\",IF(AX53<85%,\"Fail\",\"Error\"))","v":"Pass"}]
[null,null,null,null,null,"Joule",null,null,null,null,null,null,{"$f":"L53-M53","v":{"$error":"#REF!"}},null,null,null,null,null,null,null,null,null,null,null,"Joule",null,null,null,null,null,null,{"$f":"AE53-AF53","v":-0.22835820895522385},null,65,78,{"$f":"IF(X53=\"\",\"Ignore\",IF(AD53=\"Injured vs Uninjured\",AC53,AC53))","v":70},null,null,null,null,null,null,null,"Joule",null,null,null,null,null,null,{"$f":"AX53-AY53","v":-0.13793103448275867},null,{"$f":"IF(AZ53=\"Pass\",AS53,\"Enter New Value\")","v":75},95,{"$f":"IF(X39=\"Enter New Value\",\"Ignore\",IF(AW53=\"Injured vs Uninjured\",AT53,AV53))","v":87}]
[null,null,{"$f":"C53","v":"Initial Eval"},null,null,"MicroFit/Biofet",null,null,null,{"$f":"IF(I55>0,I55,H55)","v":0},{"$f":"#REF!","v":{"$error":"#REF!"}},{"$f":"#REF!","v":{"$error":"#REF!"}},0.95,null,"Injured",null,"Uninjured",null,{"$f":"#REF!","v":{"$error":"#REF!"}},null,null,{"$f":"V53","v":"Progress 1  "},{"$f":"D45","v":"Ankle_ ROM"},{"$f":"E45","v":"p"},"Step",{"$f":"O46","v":15},19,{"$f":"J45","v":20},{"$f":"IF(AB55>0,AB55,AA55)","v":20},{"$f":"IF(OR(AND((AA55/AC55>$J$31),AA55/AC55<$K$31),AB55=0), \"Injured vs uninjured\", \"Injured vs benchmark\")","v":"Injured vs uninjured"},{"$f":"IF(AD55=\"Injured vs uninjured\", Z55/AA55,Z55/AC55)","v":0.78947368421052633},{"$f":"M45","v":1},{"$f":"IF(AE55>=85%,\"Pass\",IF(AE55<85%,\"Fail\",\"Error\"))","v":"Fail"},{"$f":"AH53","v":"Injured"},"Uninjured","Benchmark",{"$f":"IF(OR(AND((AI56/AJ56>$J$31),AI56/AJ56<$K$31),AC55=0), \"Injured vs uninjured\", \"Injured vs benchmark\")","v":{"$error":"#VALUE!"}},{"$f":"IF(AK55=\"Injured vs Uninjured\", AH56/AI56,AH56/AC55)","v":{"$error":"#VALUE!"}},{"$f":"IF(AL55>=85%,\"Pass\",IF(AL55<85%,\"Fail\",\"Error\"))","v":{"$error":"#VALUE!"}},null,"Progress 2",{"$f":"W45","v":"Hamstring- Strenth End"},{"$f":"X45","v":"xgf"},"MicroFit/Biofet",{"$f":"AH46","v":8},{"$f":"AI46","v":9},{"$f":"AC45","v":9},{"$f":"IF(AU55>0,AU55,AT55)","v":9},{"$f":"IF(OR(AND((AT55/AV55>$J$31),AT55/AV55<$K$31),AU55=0), \"Injured vs uninjured\", \"Injured vs benchmark\")","v":"Injured vs benchmark"},{"$f":"IF(AW55=\"Injured vs Uninjured\", AS55/AT55,AS55/AV55)","v":0.88888888888888884},{"$f":"AF45","v":1},{"$f":"IF(AX55>=85%,\"Pass\",IF(AX55<85%,\"Fail\",\"Error\"))","v":"Pass"},{"$f":"BA53","v":"Injured"},"Uninjured","Benchmark",{"$f":"IF(OR(AND((BB56/BC56>$J$31),BB56/BC56<$K$31),AV55=0), \"Injured vs uninjured\", \"Injured vs benchmark\")","v":"Injured vs benchmark"},{"$f":"IF(BD55=\"Injured vs Uninjured\", BA56/BB56,BA56/BC56)","v":0.88888888888888884},{"$f":"IF(BE55>=85%,\"Pass\",IF(AX55<85%,\"Fail\",\"Error\"))","v":"Pass"}]
[null,null,null,null,null,"Joule",null,null,null,null,null,null,{"$f":"L55-M55","v":{"$error":"#REF!"}},null,null,null,null,null,null,null,null,null,null,null,"Numeric value",null,null,null,null,null,null,{"$f":"AE55-AF55","v":-0.21052631578947367},null,{"$f":"IF(AG55=\"pass\",Z55,\"Enter New Value\")","v":"Enter New Value"},{"$f":"IF(AG55=\"pass\",AA55,\"Enter New Value\")","v":"Enter New Value"},{"$f":"IF(X55=\"\",\"Ignore\",IF(AD55=\"Injured vs Uninjured\",AC55,AC55))","v":20},null,null,null,null,null,null,null,"Joule",null,null,null,null,null,null,{"$f":"AX55-AY55","v":-0.11111111111111116},null,{"$f":"IF(AZ55=\"Pass\",AS55,\"Enter New Value\")","v":8},{"$f":"IF(AZ55=\"Pass\",AT55,\"Enter New Value\")","v":9},{"$f":"IF(X39=\"Enter New Value\",\"Ignore\",IF(AW55=\"Injured vs Uninjured\",AT55,AV55))","v":9}]
[null,null,{"$f":"C55","v":"Initial Eval"},null,null,"MicroFit/Biofet",null,null,null,{"$f":"IF(I57>0,I57,H57)","v":0},{"$f":"#REF!","v":{"$error":"#REF!"}},{"$f":"#REF!","v":{"$error":"#REF!"}},0.95,null,"Injured",null,"Uninjured",null,{"$f":"#REF!","v":{"$error":"#REF!"}},null,null,{"$f":"V55","v":"Progress 1  "},{"$f":"D47","v":"QASLS"},{"$f":"E47","v":"h"},"MicroFit/Biofet",{"$f":"O48","v":65},{"$f":"P48","v":66},{"$f":"J47","v":70},{"$f":"IF(AB57>0,AB57,AA57)","v":70},{"$f":"IF(OR(AND((AA57/AC57>$J$31),AA57/AC57<$K$31),AB57=0), \"Injured vs uninjured\", \"Injured vs benchmark\")","v":"Injured vs uninjured"},{"$f":"IF(AD57=\"Injured vs uninjured\", Z57/AA57,Z57/AC57)","v":0.98484848484848486},{"$f":"M47","v":1},{"$f":"IF(AE57>=85%,\"Pass\",IF(AE57<85%,\"Fail\",\"Error\"))","v":"Pass"},{"$f":"AH55","v":"Injured"},"Uninjured","Benchmark",{"$f":"IF(OR(AND((AI58/AJ58>$J$31),AI58/AJ58<$K$31),AC57=0), \"Injured vs uninjured\", \"Injured vs benchmark\")","v":"Injured vs benchmark"},{"$f":"IF(AK57=\"Injured vs Uninjured\", AH58/AI58,AH58/AC57)","v":1.0142857142857142},{"$f":"IF(AL57>=85%,\"Pass\",IF(AL57<85%,\"Fail\",\"Error\"))","v":"Pass"},null,"Progress 2",{"$f":"W47","v":"Nec  rot"},{"$f":"X47","v":"aaa"},"MicroFit/Biofet",{"$f":"AH48","v":67},{"$f":"AI48","v":80},{"$f":"AC47","v":78},{"$f":"IF(AU57>0,AU57,AT57)","v":78},{"$f":"IF(OR(AND((AT57/AV57>$J$31),AT57/AV57<$K$31),AU57=0), \"Injured vs uninjured\", \"Injured vs benchmark\")","v":"Injured vs benchmark"},{"$f":"IF(AW57=\"Injured vs Uninjured\", AS57/AT57,AS57/AV57)","v":0.85897435897435892},{"$f":"AF47","v":1},{"$f":"IF(AX57>=85%,\"Pass\",IF(AX57<85%,\"Fail\",\"Error\"))","v":"Pass"},{"$f":"BA55","v":"Injured"},"Uninjured","Benchmark",{"$f":"IF(OR(AND((BB58/BC58>$J$31),BB58/BC58<$K$31),AV57=0), \"Injured vs uninjured\", \"Injured vs benchmark\")","v":"Injured vs benchmark"},{"$f":"IF(BD57=\"Injured vs Uninjured\", BA58/BB58,BA58/BC58)","v":0.85897435897435892},{"$f":"IF(BE57>=85%,\"Pass\",IF(AX57<85%,\"Fail\",\"Error\"))","v":"Pass"}]
[null,null,null,null,null,"Joule",null,null,null,null,null,null,{"$f":"L57-M57","v":{"$error":"#REF!"}},null,null,null,null,null,null,null,null,null,null,null,"Kg",null,null,null,null,null,null,{"$f":"AE57-AF57","v":-1.5151515151515138E-2},null,71,80,{"$f":"IF(X57=\"\",\"Ignore\",IF(AD57=\"Injured vs Uninjured\",AC57,AC57))","v":70},null,null,null,null,null,null,null,"Joule",null,null,null,null,null,null,{"$f":"AX57-AY57","v":-0.14102564102564108},null,{"$f":"IF(AZ57=\"Pass\",AS57,\"Enter New Value\")","v":67},{"$f":"IF(AZ57=\"Pass\",AT57,\"Enter New Value\")","v":80},{"$f":"IF(X39=\"Enter New Value\",\"Ignore\",IF(AW57=\"Injured vs Uninjured\",AT57,AV57))","v":78}]
[null,null,null,null,"j",null,null,null,null,null,null,null,null,null,null,null,null,null,null,null,null,null,null,null,null,null,null,null,null,null,null,null,null,null,null,null,null,null,null,null,{"$f":"AO57","v":"Progress 2"},{"$f":"W49","v":"External Rot_Peak F"},{"$f":"X49","v":"u"},"Goniometre",{"$f":"AH50","v":21},{"$f":"AI50","v":22},{"$f":"AB49","v":25},{"$f":"IF(AU59>0,AU59,AT59)","v":25},{"$f":"IF(OR(AND((AT59/AV59>$J$31),AT59/AV59<$K$31),AU59=0), \"Injured vs uninjured\", \"Injured vs benchmark\")","v":"Injured vs uninjured"},{"$f":"IF(AW59=\"Injured vs Uninjured\", AS59/AT59,AS59/AV59)","v":0.95454545454545459},{"$f":"M39","v":1},{"$f":"IF(AX59>=85%,\"Pass\",IF(AX59<85%,\"Fail\",\"Error\"))","v":"Pass"},{"$f":"BA57","v":"Injured"},"Uninjured","Benchmark",{"$f":"IF(OR(AND((BB60/BC60>$J$31),BB60/BC60<$K$31),AV59=0), \"Injured vs uninjured\", \"Injured vs benchmark\")","v":"Injured vs benchmark"},{"$f":"IF(BD59=\"Injured vs Uninjured\", BA60/BB60,BA60/BC60)","v":0.95454545454545459},{"$f":"IF(BE59>=85%,\"Pass\",IF(AX59<85%,\"Fail\",\"Error\"))","v":"Pass"}]
[null,null,null,null,null,null,null,null,null,null,null,null,null,null,null,null,null,null,null,null,null,null,null,null,null,null,null,null,null,null,null,null,null,null,null,null,null,null,null,null,null,null,null,"Degrees",null,null,null,null,null,null,{"$f":"AX59-AY59","v":-4.5454545454545414E-2},null,{"$f":"IF(AZ59=\"Pass\",AS59,\"Enter New Value\")","v":21},{"$f":"IF(AZ59=\"Pass\",AT59,\"Enter New Value\")","v":22},{"$f":"IF(X39=\"Enter New Value\",\"Ignore\",IF(AW59=\"Injured vs Uninjured\",AT59,AV59))","v":22}]
[null,null,null,null,null,null,null,null,null,null,null,null,null,null,null,null,null,null,null,null,null,null,null,null,null,null,null,null,null,null,null,null,null,null,null,null,null,null,null,null,{"$f":"AO59","v":"Progress 2"},{"$f":"W51","v":"Hamstring- Strenth End"},{"$f":"X51","v":"f"},"Goniometre",{"$f":"AH52","v":27},{"$f":"AI52","v":29},{"$f":"AB51","v":30},{"$f":"IF(AU61>0,AU61,AT61)","v":30},{"$f":"IF(OR(AND((AT61/AV61>$J$31),AT61/AV61<$K$31),AU61=0), \"Injured vs uninjured\", \"Injured vs benchmark\")","v":"Injured vs uninjured"},0.93103448275862066,{"$f":"M41","v":0.9},{"$f":"IF(AX61>=85%,\"Pass\",IF(AX61<85%,\"Fail\",\"Error\"))","v":"Pass"},{"$f":"BA59","v":"Injured"},"Uninjured","Benchmark",{"$f":"IF(OR(AND((BB62/BC62>$J$31),BB62/BC62<$K$31),AV61=0), \"Injured vs uninjured\", \"Injured vs benchmark\")","v":"Injured vs benchmark"},{"$f":"IF(BD61=\"Injured vs Uninjured\", BA62/BB62,BA62/BC62)","v":0.93103448275862066},{"$f":"IF(BE61>=85%,\"Pass\",IF(AX61<85%,\"Fail\",\"Error\"))","v":"Pass"}]
[null,null,null,null,null,null,null,null,null,null,null,null,null,null,null,null,null,null,null,null,null,null,null,null,null,null,null,null,null,null,null,null,null,null,null,null,null,null,null,null,null,null,null,"Degrees",null,null,null,null,null,null,{"$f":"AX61-AY61","v":3.1034482758620641E-2},null,{"$f":"IF(AZ61=\"Pass\",AS61,\"Enter New Value\")","v":27},{"$f":"IF(AZ61=\"Pass\",AT61,\"Enter New Value\")","v":29},{"$f":"IF(X39=\"Enter New Value\",\"Ignore\",IF(AW61=\"Injured vs Uninjured\",AT61,AV61))","v":29}]
[null,null,null,null,null,null,null,null,null,null,null,null,null,null,null,null,null,null,null,null,null,null,null,null,null,null,null,null,null,null,null,null,null,null,null,null,null,null,null,null,{"$f":"AO61","v":"Progress 2"},{"$f":"W53","v":"Quadriceps- PF"},{"$f":"X53","v":"g"},"MicroFit/Biofet",{"$f":"AH54","v":65},78,{"$f":"AB53","v":70},{"$f":"IF(AU63>0,AU63,AT63)","v":70},{"$f":"IF(OR(AND((AT63/AV63>$J$31),AT63/AV63<$K$31),AU63=0), \"Injured vs uninjured\", \"Injured vs benchmark\")","v":"Injured vs benchmark"},{"$f":"IF(AW63=\"Injured vs Uninjured\", AS63/AT63,AS63/AV63)","v":0.9285714285714286},{"$f":"M43","v":0.9},{"$f":"IF(AX63>=85%,\"Pass\",IF(AX63<85%,\"Fail\",\"Error\"))","v":"Pass"},{"$f":"BA61","v":"Injured"},"Uninjured","Benchmark",{"$f":"IF(OR(AND((BB64/BC64>$J$31),BB64/BC64<$K$31),AV63=0), \"Injured vs uninjured\", \"Injured vs benchmark\")","v":"Injured vs benchmark"},{"$f":"IF(BD63=\"Injured vs Uninjured\", BA64/BB64,BA64/BC64)","v":0.9285714285714286},{"$f":"IF(BE63>=85%,\"Pass\",IF(AX63<85%,\"Fail\",\"Error\"))","v":"Pass"}]
[null,null,null,null,null,null,null,null,null,null,null,null,null,null,null,null,null,null,null,null,null,null,null,null,null,null,null,null,null,null,null,null,null,null,null,null,null,null,null,null,null,null,null,"Joule",null,null,null,null,null,null,{"$f":"AX63-AY63","v":2.8571428571428581E-2},null,{"$f":"IF(AZ63=\"Pass\",AS63,\"Enter New Value\")","v":65},{"$f":"IF(AZ63=\"Pass\",AT63,\"Enter New Value\")","v":78},{"$f":"IF(X39=\"Enter New Value\",\"Ignore\",IF(AW63=\"Injured vs Uninjured\",AT63,AV63))","v":70}]
[null,null,null,null,null,null,null,null,null,null,null,null,null,null,null,null,null,null,null,null,null,null,null,null,null,null,null,null,null,null,null,null,null,null,null,null,null,null,null,null,{"$f":"AO63","v":"Progress 2"},{"$f":"W55","v":"Ankle_ ROM"},{"$f":"X55","v":"p"},"Step",{"$f":"AH56","v":"Enter New Value"},"Enter New Value",{"$f":"AB55","v":20},{"$f":"IF(AU65>0,AU65,AT65)","v":20},{"$f":"IF(OR(AND((AT65/AV65>$J$31),AT65/AV65<$K$31),AU65=0), \"Injured vs uninjured\", \"Injured vs benchmark\")","v":{"$error":"#VALUE!"}},{"$error":"#VALUE!"},{"$f":"M45","v":1},{"$f":"IF(AX65>=85%,\"Pass\",IF(AX65<85%,\"Fail\",\"Error\"))","v":{"$error":"#VALUE!"}},{"$f":"BA63","v":"Injured"},"Uninjured","Benchmark",{"$f":"IF(OR(AND((BB66/BC66>$J$31),BB66/BC66<$K$31),AV65=0), \"Injured vs uninjured\", \"Injured vs benchmark\")","v":{"$error":"#VALUE!"}},{"$f":"IF(BD65=\"Injured vs Uninjured\", BA66/BB66,BA66/BC66)","v":{"$error":"#VALUE!"}},{"$f":"IF(BE65>=85%,\"Pass\",IF(AX65<85%,\"Fail\",\"Error\"))","v":{"$error":"#VALUE!"}}]
[null,null,null,null,null,null,null,null,null,null,null,null,null,null,null,null,null,null,null,null,null,null,null,null,null,null,null,null,null,null,null,null,null,null,null,null,null,null,null,null,null,null,null,"Numeric value",null,null,null,null,null,null,{"$f":"AX65-AY65","v":{"$error":"#VALUE!"}},null,{"$f":"IF(AZ65=\"pass\",AS65,\"Enter New Value\")","v":{"$error":"#VALUE!"}},{"$f":"IF(AZ65=\"pass\",AT65,\"Enter New Value\")","v":{"$error":"#VALUE!"}},{"$f":"IF(X39=\"Enter New Value\",\"Ignore\",IF(AW65=\"Injured vs Uninjured\",AT65,AV65))","v":{"$error":"#VALUE!"}}]
[null,null,null,null,null,null,null,null,null,null,null,null,null,null,null,null,null,null,null,null,null,null,null,null,null,null,null,null,null,null,null,null,null,null,null,null,null,null,null,null,{"$f":"AO65","v":"Progress 2"},{"$f":"W57","v":"QASLS"},{"$f":"X57","v":"h"},"MicroFit/Biofet",{"$f":"AH58","v":71},80,{"$f":"AB57","v":70},{"$f":"IF(AU67>0,AU67,AT67)","v":70},{"$f":"IF(OR(AND((AT67/AV67>$J$31),AT67/AV67<$K$31),AU67=0), \"Injured vs uninjured\", \"Injured vs benchmark\")","v":"Injured vs benchmark"},1.0142857142857142,{"$f":"M47","v":1},{"$f":"IF(AX67>=85%,\"Pass\",IF(AX67<85%,\"Fail\",\"Error\"))","v":"Pass"},{"$f":"BA65","v":"Injured"},"Uninjured","Benchmark",{"$f":"IF(OR(AND((BB68/BC68>$J$31),BB68/BC68<$K$31),AV67=0), \"Injured vs uninjured\", \"Injured vs benchmark\")","v":"Injured vs benchmark"},{"$f":"IF(BD67=\"Injured vs Uninjured\", BA68/BB68,BA68/BC68)","v":1.0142857142857142},{"$f":"IF(BE67>=85%,\"Pass\",IF(AX67<85%,\"Fail\",\"Error\"))","v":"Pass"}]
[null,null,null,null,null,null,null,null,null,null,null,null,null,null,null,null,null,null,null,null,null,null,null,null,null,null,null,null,null,null,null,null,null,null,null,null,null,null,null,null,null,null,null,"Kg",null,null,null,null,null,null,{"$f":"AX67-AY67","v":1.4285714285714235E-2},null,{"$f":"IF(AZ67=\"Pass\",AS67,\"Enter New Value\")","v":71},{"$f":"IF(AZ67=\"Pass\",AT67,\"Enter New Value\")","v":80},{"$f":"IF(X39=\"Enter New Value\",\"Ignore\",IF(AW67=\"Injured vs Uninjured\",AT67,AV67))","v":70}]
[]
[]
["Initial Eval",null,"Initial","Initial","Initial","Initial","Progress 1  "]
[null,"Performance Based Outcomes",{"$f":"K37","v":"Comparisons"},{"$f":"L37","v":"Difference"},"Target","Performance deficit",null,"Performance Based Outcomes","Comparison","Difference","Target","Performance Deficit","Progress","Discharge",{"$f":"H72","v":"Performance Based Outcomes"},"Comparison","Diff after Interv","Target","Performance Deficit","Progress",{"$f":"N72","v":"Discharge"},"Performance Based Outcomes","Comparison","Diff after Interv","Target","Performance Deficit","Progress"]
["Column1","Column2","Column3","Column4","Column5","Column6","Column7","Column8","Column9","Column10","Column11","Column12","Column13","Column14","Column15","Column16","Column17","Column18","Column19","Column20",{"$f":"N74","v":"Initial Eval"},{"$f":"O74","v":"External Rot_Peak F"},{"$f":"BD59","v":"Injured vs benchmark"},{"$f":"BE59","v":0.95454545454545459},{"$f":"R74","v":1},{"$f":"X73-Y73","v":-4.5454545454545414E-2},{"$f":"X73-Q74","v":0}]
[{"$f":"C39","v":"Initial Eval"},{"$f":"D39","v":"External Rot_Peak F"},{"$f":"K39","v":"Injured vs benchmark"},{"$f":"L39","v":0.48},{"$f":"M39","v":1},{"$f":"E74-D74","v":0.52},{"$f":"A74","v":"Initial Eval"},{"$f":"B74","v":"External Rot_Peak F"},{"$f":"R39","v":"Injured vs uninjured"},{"$f":"S39","v":0.95454545454545459},{"$f":"E74","v":1},{"$f":"J74-K74","v":-4.5454545454545414E-2},{"$f":"J74-D74","v":0.4745454545454546},"Initial Eval","External Rot_Peak F","Injured vs uninjured",{"$f":"AL49","v":0.95454545454545459},1,{"$f":"Q74-R74","v":-4.5454545454545414E-2},{"$f":"Q74-J74","v":0},"Initial Eval","Hamstring- Strenth End",{"$f":"BD61","v":"Injured vs benchmark"},{"$f":"BE61","v":0.93103448275862066},0.9,{"$f":"X74-Y74","v":3.1034482758620641E-2},{"$f":"X74-Q75","v":0}]
[{"$f":"C41","v":"Initial Eval"},{"$f":"D41","v":"Hamstring- Strenth End"},{"$f":"K41","v":"Injured vs benchmark"},{"$f":"L41","v":0.66666666666666663},{"$f":"M41","v":0.9},{"$f":"E75-D75","v":0.23333333333333339},"Initial Eval",{"$f":"B75","v":"Hamstring- Strenth End"},{"$f":"R41","v":"Injured vs uninjured"},{"$f":"S41","v":0.93103448275862066},{"$f":"E75","v":0.9},{"$f":"J75-K75","v":3.1034482758620641E-2},0.26436781609195403,"Initial Eval","Hamstring- Strenth End",{"$f":"AK51","v":"Injured vs uninjured"},{"$f":"AL51","v":0.93103448275862066},0.9,{"$f":"Q75-R75","v":3.1034482758620641E-2},{"$f":"Q75-J75","v":0},"Initial Eval","Quadriceps- PF",{"$f":"BD63","v":"Injured vs benchmark"},{"$f":"BE63","v":0.9285714285714286},0.9,2.8571428571428581E-2,{"$f":"X75-Q76","v":0}]
[{"$f":"C43","v":"Initial Eval"},{"$f":"D43","v":"Quadriceps- PF"},{"$f":"K43","v":"Injured vs uninjured"},{"$f":"L43","v":0.5714285714285714},{"$f":"M43","v":0.9},0.32857142857142863,"Initial Eval",{"$f":"B76","v":"Quadriceps- PF"},{"$f":"R43","v":"Injured vs uninjured"},{"$f":"S43","v":0.67164179104477617},{"$f":"E76","v":0.9},-0.22835820895522385,0.10021321961620477,"Initial Eval","Quadriceps- PF",{"$f":"AK53","v":"Injured vs benchmark"},{"$f":"AL53","v":0.9285714285714286},0.9,2.8571428571428581E-2,0.25692963752665243,"Initial Eval","Ankle_ ROM",{"$f":"BD65","v":{"$error":"#VALUE!"}},{"$f":"BE65","v":{"$error":"#VALUE!"}},1,{"$error":"#VALUE!"},{"$f":"X76-Q77","v":{"$error":"#VALUE!"}}]
[{"$f":"C45","v":"Initial Eval"},{"$f":"D45","v":"Ankle_ ROM"},{"$f":"K45","v":"Injured vs uninjured"},{"$f":"L45","v":0.5},{"$f":"M45","v":1},0.5,"Initial Eval",{"$f":"B77","v":"Ankle_ ROM"},{"$f":"R45","v":"Injured vs uninjured"},{"$f":"S45","v":0.78947368421052633},{"$f":"E77","v":1},-0.21052631578947367,0.28947368421052633,"Initial Eval","Ankle_ ROM",{"$f":"AK55","v":{"$error":"#VALUE!"}},{"$f":"AL55","v":{"$error":"#VALUE!"}},1,{"$error":"#VALUE!"},{"$error":"#VALUE!"},"Initial Eval","QASLS",{"$f":"BD67","v":"Injured vs benchmark"},{"$f":"BE67","v":1.0142857142857142},1,1.4285714285714235E-2,{"$f":"X77-Q78","v":0}]
[{"$f":"C47","v":"Initial Eval"},{"$f":"D47","v":"QASLS"},{"$f":"K47","v":"Injured vs uninjured"},{"$f":"L47","v":0.46153846153846156},{"$f":"M47","v":1},0.53846153846153844,"Initial Eval",{"$f":"B78","v":"QASLS"},{"$f":"R47","v":"Injured vs uninjured"},{"$f":"S47","v":0.98484848484848486},{"$f":"E78","v":1},-1.5151515151515138E-2,0.5233100233100233,"Initial Eval","QASLS",{"$f":"AK57","v":"Injured vs benchmark"},{"$f":"AL57","v":1.0142857142857142},1,1.4285714285714235E-2,2.9437229437229373E-2]
[{"$f":"V39","v":"Progress 1  "},{"$f":"W39","v":"GIRD_"},{"$f":"AD39","v":"Injured vs benchmark"},{"$f":"AE39","v":0.625},{"$f":"AF39","v":1},0.375,{"$f":"A79","v":"Progress 1  "},"GIRD_",{"$f":"AK39","v":"Injured vs uninjured"},{"$f":"AL39","v":0.8146067415730337},{"$f":"AF39","v":1},-0.1853932584269663,0.1896067415730337,{"$f":"AO49","v":"Progress 2"},{"$f":"AP49","v":"GIRD_"},{"$f":"BD49","v":"Injured vs benchmark"},{"$f":"BE49","v":1},{"$f":"K79","v":1},0,{"$f":"Q79-J79","v":0.1853932584269663}]
[{"$f":"V41","v":"Progress 1  "},{"$f":"W41","v":"PGM- Strength end"},{"$f":"AD41","v":"Injured vs benchmark"},{"$f":"AE41","v":0.42105263157894735},{"$f":"AF41","v":1},0.57894736842105265,"Progress 1  ","PGM- Strength end",{"$f":"AK41","v":"Injured vs uninjured"},{"$f":"AL41","v":0.61604938271604937},{"$f":"AF41","v":1},-0.38395061728395063,{"$f":"J80-D80","v":0.19499675113710202},{"$f":"AO51","v":"Progress 2"},{"$f":"AP51","v":"PGM- Strength end"},{"$f":"BD51","v":"Injured vs benchmark"},{"$f":"BE51","v":0.86172839506172838},{"$f":"K80","v":1},-0.13827160493827162,{"$f":"Q80-J80","v":0.24567901234567902}]
[{"$f":"V43","v":"Progress 1  "},{"$f":"W43","v":"Glut Max_ "},{"$f":"AD43","v":"Injured vs uninjured"},{"$f":"AE43","v":0.6},{"$f":"AF43","v":1},0.4,"Progress 1  ","Glut Max_ ",{"$f":"AK43","v":"Injured vs uninjured"},{"$f":"AL43","v":0.86206896551724133},{"$f":"AF43","v":1},-0.13793103448275867,0.26206896551724135,{"$f":"AO53","v":"Progress 2"},{"$f":"AP53","v":"Glut Max_ "},{"$f":"BD53","v":"Injured vs benchmark"},{"$f":"BE53","v":0.86206896551724133},1,-0.13793103448275867,0]
[{"$f":"V45","v":"Progress 1  "},{"$f":"W45","v":"Hamstring- Strenth End"},{"$f":"AD45","v":"Injured vs benchmark"},{"$f":"AE45","v":0.55555555555555558},{"$f":"AF45","v":1},0.44444444444444442,"Progress 1  ","Hamstring- Strenth End",{"$f":"AK45","v":"Injured vs benchmark"},{"$f":"AL45","v":0.88888888888888884},{"$f":"AF45","v":1},-0.11111111111111116,0.33333333333333326,{"$f":"AO55","v":"Progress 2"},{"$f":"AP55","v":"Hamstring- Strenth End"},{"$f":"BD55","v":"Injured vs benchmark"},{"$f":"BE55","v":0.88888888888888884},1,-0.11111111111111116,0]
[{"$f":"V47","v":"Progress 1  "},{"$f":"W47","v":"Nec  rot"},{"$f":"AD47","v":"Injured vs uninjured"},{"$f":"AE47","v":0.57692307692307687},{"$f":"AF47","v":1},0.42307692307692313,"Progress 1  ","Nec  rot",{"$f":"AK47","v":"Injured vs benchmark"},{"$f":"AL47","v":0.85897435897435892},{"$f":"AF47","v":1},-0.14102564102564108,0.28205128205128205,{"$f":"AO57","v":"Progress 2"},{"$f":"AP57","v":"Nec  rot"},{"$f":"BD57","v":"Injured vs benchmark"},{"$f":"BE57","v":0.85897435897435892},1,-0.14102564102564108,0]
[{"$f":"AO39","v":"Discharge"},{"$f":"AP39","v":"RSI"},{"$f":"AW39","v":"Injured vs benchmark"},{"$f":"AX39","v":0.5},{"$f":"AY39","v":1},{"$f":"E84-D84","v":0.5},{"$f":"A84","v":"Discharge"},{"$f":"B84","v":"RSI"},{"$f":"BD39","v":"Injured vs uninjured"},{"$f":"BE39","v":0.9},{"$f":"E84","v":1},{"$f":"K84-J84","v":9.9999999999999978E-2},{"$f":"J84-D84","v":0.4}]
[{"$f":"AO41","v":"Discharge"},{"$f":"AP41","v":"DSI"},{"$f":"AW41","v":"Injured vs benchmark"},{"$f":"AX41","v":0.375},{"$f":"AY41","v":0.95},{"$f":"E85-D85","v":0.57499999999999996},"Discharge","DSI",{"$f":"BD41","v":"Injured vs benchmark"},{"$f":"BE41","v":0.55833333333333335},0.95,{"$f":"K85-J85","v":0.39166666666666661},{"$f":"J85-D85","v":0.18333333333333335}]
[{"$f":"AO43","v":"Discharge"},{"$f":"AP43","v":"PSI"},{"$f":"AW43","v":"Injured vs benchmark"},{"$f":"AX43","v":0.67},{"$f":"AY43","v":0.95},{"$f":"E86-D86","v":0.27999999999999992},"Discharge","PSI",{"$f":"BD43","v":"Injured vs benchmark"},{"$f":"BE43","v":0.89},0.95,5.9999999999999942E-2,0.21999999999999997]
[{"$f":"AO45","v":"Discharge"},{"$f":"AP45","v":"LSI"},{"$f":"AW45","v":"Injured vs benchmark"},{"$f":"AX45","v":0.5},{"$f":"AY45","v":0.95},{"$f":"E87-D87","v":0.44999999999999996},"Discharge","LSI",{"$f":"BD45","v":"Injured vs uninjured"},{"$f":"BE45","v":0.88888888888888884},0.95,6.1111111111111116E-2,0.38888888888888884]
[{"$f":"AO47","v":"Discharge"},{"$f":"AP47","v":"BMP"},{"$f":"AW47","v":"Injured vs benchmark"},{"$f":"AX47","v":0.55500000000000005},{"$f":"AY47","v":0.95},{"$f":"E88-D88","v":0.39499999999999991},"Discharge","BMP",{"$f":"BD47","v":"Injured vs uninjured"},{"$f":"BE47","v":0.875},0.95,7.4999999999999956E-2,0.31999999999999995]
[]
[]
[]
[]
[]
[]
[]
[]
[]
[]
[]
[null,null,null,null,null,null,null,null,null,null,null,null,"Unjured(Improvement"]
[]
[]
[]
[]
[]
[]
[null,null,null,null,null,null,null,null,null,"Progress","Progress"]
[null,null,null,null,null,null,null,null,null,{"$f":"D169","v":"Uninjured "},{"$f":"E169","v":"Bench mark"},"Injured(Improvement"]
[null,null,null,null,null,null,null,null,null,{"$f":"P40","v":22},{"$f":"Q40","v":25}]
[null,null,null,null,null,null,null,null,null,{"$f":"P42","v":29},{"$f":"Q42","v":30}]
[null,null,null,null,null,null,null,null,null,{"$f":"P44","v":67},{"$f":"Q44","v":70}]
[null,null,null,null,null,null,null,null,null,{"$f":"P46","v":19},{"$f":"Q46","v":20}]
[null,null,null,null,null,null,null,null,null,{"$f":"P48","v":66},{"$f":"Q48","v":70}]
[]
[]
[]
[]
[]
[]
[]
[]
[]
[]
[]
[]
[]
[]
[]
[]
[]
[]
[]
[]
[]
[]
[]
[]
[]
[]
[]
[]
[]
[]
[]
[]
[]
[]
[]
[]
[]
[]
[]
[]
[]
[]
[]
[]
[]
[]
[]
[]
[]
[]
[]
[]
[]
[]
[{"$f":"A71","v":"Initial Eval"},{"$f":"B71","v":0},"Initial","Initial","Initial",null,"Progress ",{"$f":"B168","v":0},"Progress"]
[{"$f":"A72","v":0},{"$f":"B72","v":"Performance Based Outcomes"},{"$f":"G37","v":"Injured"},{"$f":"H37","v":"Uninjured "},{"$f":"I37","v":"Bench mark"},null,{"$f":"A169","v":0},"Performance Based Outcomes",{"$f":"C169","v":"Injured"}]
[{"$f":"A74","v":"Initial Eval"},"External Rot_Peak F",{"$f":"G39","v":12},{"$f":"H39","v":15},{"$f":"I39","v":25},null,"Progress ","External Rot_Peak F",{"$f":"O40","v":21}]
["Initial Eval","Hamstring- Strenth End",{"$f":"G41","v":20},{"$f":"H41","v":20},{"$f":"I41","v":30},null,null,"Hamstring- Strenth End",{"$f":"O42","v":27}]
["Initial Eval","Quadriceps- PF",{"$f":"G43","v":40},{"$f":"H43","v":70},{"$f":"I43","v":0},null,null,"Quadriceps- PF",{"$f":"O44","v":45}]
["Initial Eval","Ankle_ ROM",{"$f":"G45","v":10},{"$f":"H45","v":20},{"$f":"I45","v":0},null,null,"Ankle_ ROM",{"$f":"O46","v":15}]
["Initial Eval","QASLS",{"$f":"G47","v":30},{"$f":"H47","v":65},{"$f":"I47","v":70},null,null,"QASLS",{"$f":"O48","v":65}]

{"sheet":"Input Sheet","index":2,"n_rows":187,"n_cols":58,"rows_kept":187,"cut":false,"hidden":false,"merged":[[7,45,7,50],[8,45,8,50],[10,45,10,50],[11,45,11,50],[12,45,12,50],[13,45,13,50],[50,40,51,40],[52,40,53,40],[36,49,37,49],[36,40,37,41],[36,42,37,42],[36,44,37,44],[36,45,37,45],[36,46,37,46],[36,47,37,47],[36,48,37,48],[12,40,12,41],[20,46,20,47],[20,48,21,51],[19,40,19,51],[46,48,47,48],[44,48,45,48],[42,48,43,48],[40,48,41,48],[38,48,39,48],[38,41,39,41],[40,41,41,41],[46,19,47,19],[44,46,45,46],[44,47,45,47],[44,19,45,19],[42,46,43,46],[42,44,43,44],[42,45,43,45],[42,23,43,23],[42,25,43,25],[42,26,43,26],[42,27,43,27],[42,28,43,28],[40,36,41,36],[40,38,41,38],[40,23,41,23],[40,25,41,25],[40,26,41,26],[98,0,99,3],[68,46,69,46],[42,19,43,19],[42,47,43,47],[68,47,69,47],[68,48,69,48],[64,46,65,46],[64,47,65,47],[64,48,65,48],[60,46,61,46],[54,46,55,46],[54,47,55,47],[54,48,55,48],[52,46,53,46],[52,47,53,47],[52,48,53,48],[42,4,43,4],[42,6,43,6],[46,46,47,46],[46,47,47,47],[54,40,55,40],[56,40,57,40],[66,47,67,47],[66,48,67,48],[66,49,67,49],[66,51,67,51],[66,57,67,57],[68,40,69,40],[68,41,69,41],[68,42,69,42],[68,44,69,44],[68,45,69,45],[66,40,67,40],[66,41,67,41],[66,42,67,42],[66,44,67,44],[66,45,67,45],[66,46,67,46],[68,49,69,49],[64,51,65,51],[64,57,65,57],[62,47,63,47],[62,48,63,48],[62,49,63,49],[62,51,63,51],[62,57,63,57],[62,46,63,46],[64,40,65,40],[64,41,65,41],[64,42,65,42],[64,44,65,44],[64,45,65,45],[62,40,63,40],[62,41,63,41],[62,42,63,42],[62,44,63,44],[62,45,63,45],[64,49,65,49],[60,51,61,51],[60,57,61,57],[58,47,59,47],[58,48,59,48],[58,49,59,49],[58,51,59,51],[58,57,59,57],[58,46,59,46],[60,40,61,40],[60,41,61,41],[60,42,61,42],[60,44,61,44],[60,45,61,45],[58,40,59,40],[58,41,59,41],[58,42,59,42],[58,44,59,44],[58,45,59,45],[60,47,61,47],[60,48,61,48],[60,49,61,49],[56,51,57,51],[56,57,57,57],[56,30,57,30],[56,32,57,32],[56,38,57,38],[56,42,57,42],[56,44,57,44],[56,45,57,45],[56,23,57,23],[56,25,57,25],[56,26,57,26],[56,27,57,27],[56,28,57,28],[56,29,57,29],[56,46,57,46],[56,47,57,47],[56,48,57,48],[56,49,57,49],[56,9,57,9],[56,10,57,10],[56,11,57,11],[56,18,57,18],[56,21,57,21],[56,22,57,22],[56,2,57,2],[56,3,57,3],[56,4,57,4],[56,6,57,6],[56,7,57,7],[56,8,57,8],[54,2,55,2],[54,3,55,3],[54,4,55,4],[54,49,55,49],[54,51,55,51],[54,57,55,57],[54,30,55,30],[54,32,55,32],[54,38,55,38],[54,42,55,42],[54,44,55,44],[54,45,55,45],[54,6,55,6],[54,7,55,7],[54,8,55,8],[54,23,55,23],[54,25,55,25],[54,26,55,26],[54,27,55,27],[54,28,55,28],[54,29,55,29],[54,9,55,9],[54,10,55,10],[54,11,55,11],[52,51,53,51],[52,57,53,57],[52,30,53,30],[52,32,53,32],[52,38,53,38],[52,42,53,42],[52,44,53,44],[52,45,53,45],[52,23,53,23],[52,25,53,25],[52,26,53,26],[52,27,53,27],[52,28,53,28],[52,29,53,29],[52,49,53,49],[52,9,53,9],[52,10,53,10],[52,11,53,11],[52,18,53,18],[52,21,53,21],[52,22,53,22],[52,2,53,2],[52,3,53,3],[52,4,53,4],[52,6,53,6],[52,7,53,7],[52,8,53,8],[50,51,51,51],[50,57,51,57],[50,30,51,30],[50,32,51,32],[50,38,51,38],[50,42,51,42],[50,44,51,44],[50,45,51,45],[50,27,51,27],[50,28,51,28],[50,29,51,29],[50,46,51,46],[50,47,51,47],[50,48,51,48],[50,49,51,49],[50,9,51,9],[50,10,51,10],[50,11,51,11],[50,18,51,18],[50,21,51,21],[50,22,51,22],[50,2,51,2],[50,3,51,3],[50,4,51,4],[50,6,51,6],[50,7,51,7],[50,8,51,8],[48,51,49,51],[48,57,49,57],[48,30,49,30],[48,32,49,32],[48,38,49,38],[48,42,49,42],[48,44,49,44],[48,45,49,45],[48,23,49,23],[48,25,49,25],[48,26,49,26],[48,27,49,27],[48,28,49,28],[48,29,49,29],[48,46,49,46],[48,47,49,47],[48,48,49,48],[48,40,49,40],[48,49,49,49],[46,51,47,51],[46,57,47,57],[48,2,49,2],[48,3,49,3],[48,4,49,4],[48,6,49,6],[48,7,49,7],[48,8,49,8],[46,32,47,32],[46,36,47,36],[46,38,47,38],[46,42,47,42],[46,44,47,44],[46,45,47,45],[46,23,47,23],[46,25,47,25],[46,26,47,26],[46,27,47,27],[46,28,47,28],[46,29,47,29],[46,10,47,10],[46,11,47,11],[46,13,47,13],[46,17,47,17],[42,51,43,51],[42,57,43,57],[44,51,45,51],[44,57,45,57],[46,3,47,3],[46,4,47,4],[46,6,47,6],[46,7,47,7],[46,8,47,8],[46,9,47,9],[44,32,45,32],[44,36,45,36],[44,38,45,38],[44,42,45,42],[44,44,45,44],[44,45,45,45],[44,23,45,23],[44,25,45,25],[44,26,45,26],[44,27,45,27],[44,28,45,28],[44,29,45,29],[44,10,45,10],[44,11,45,11],[48,18,49,18],[48,21,49,21],[48,22,49,22],[50,23,51,23],[50,25,51,25],[50,26,51,26],[54,18,55,18],[54,21,55,21],[54,22,55,22],[42,32,43,32],[42,36,43,36],[42,38,43,38],[42,42,43,42],[35,39,57,39],[38,23,39,23],[38,25,39,25],[38,26,39,26],[38,27,39,27],[36,30,37,30],[36,57,37,57],[40,57,41,57],[40,42,41,42],[40,44,41,44],[40,32,41,32],[38,36,39,36],[38,38,39,38],[36,32,37,32],[38,32,39,32],[38,46,39,46],[38,47,39,47],[40,45,41,45],[38,51,39,51],[38,57,39,57],[38,42,39,42],[38,44,39,44],[38,45,39,45],[40,46,41,46],[40,47,41,47],[40,51,41,51],[36,9,37,9],[36,52,37,54],[36,56,37,56],[36,55,37,55],[36,27,37,27],[36,28,37,28],[36,29,37,29],[36,10,37,10],[36,11,37,11],[36,21,37,22],[36,23,37,23],[36,25,37,25],[36,26,37,26],[42,2,43,2],[44,2,45,2],[46,2,47,2],[38,2,39,2],[40,2,41,2],[40,3,41,3],[40,4,41,4],[40,6,41,6],[40,7,41,7],[38,3,39,3],[38,4,39,4],[38,6,39,6],[38,7,39,7],[40,8,41,8],[40,9,41,9],[42,7,43,7],[42,8,43,8],[42,9,43,9],[46,21,47,21],[36,2,37,3],[36,4,37,4],[38,28,39,28],[38,29,39,29],[38,10,39,10],[38,11,39,11],[38,13,39,13],[38,18,39,18],[40,18,41,18],[38,21,39,21],[40,21,41,21],[38,17,39,17],[38,19,39,19],[40,27,41,27],[40,28,41,28],[40,29,41,29],[40,10,41,10],[40,11,41,11],[42,21,43,21],[44,21,45,21],[42,29,43,29],[42,10,43,10],[42,11,43,11],[42,13,43,13],[42,17,43,17],[44,13,45,13],[44,17,45,17],[35,0,59,1],[35,2,35,12],[35,20,57,20],[40,13,41,13],[40,17,41,17],[40,19,41,19],[44,3,45,3],[44,4,45,4],[44,6,45,6],[44,7,45,7],[44,8,45,8],[44,9,45,9],[42,3,43,3],[48,9,49,9],[48,10,49,10],[48,11,49,11],[42,18,43,18],[44,18,45,18],[46,18,47,18],[38,8,39,8],[38,9,39,9],[36,6,37,6],[36,7,37,7],[36,8,37,8],[15,25,15,35],[20,0,20,10],[21,2,22,3],[21,4,21,5],[21,6,22,10],[20,13,20,23],[21,13,22,14],[21,15,22,16],[21,17,21,18],[21,19,21,20],[21,21,22,23],[21,27,22,28],[15,0,15,10],[17,18,17,23],[18,18,18,23],[19,18,19,23],[16,18,16,23],[21,33,22,35],[10,2,10,3],[11,0,12,1],[10,15,10,16],[13,15,13,16],[14,15,14,16],[10,13,10,14],[11,13,12,14],[13,13,13,14],[14,13,14,14],[14,0,14,1],[14,2,14,3],[13,0,13,1],[13,2,13,3],[10,5,10,10],[11,5,11,10],[12,5,12,10],[13,5,13,10],[14,5,14,10],[6,25,6,35],[7,29,8,29],[7,0,7,1],[7,2,7,3],[7,4,7,10],[9,0,9,1],[9,2,9,3],[8,15,8,16],[9,15,9,16],[8,13,8,14],[9,13,9,14],[9,25,9,26],[8,5,9,10],[8,0,8,1],[8,2,8,3],[8,4,9,4],[14,40,14,51],[0,8,0,10],[5,40,5,50],[6,0,6,10],[6,40,6,41],[6,42,6,43],[6,44,6,50],[7,40,7,41],[7,42,7,43],[7,15,7,16],[5,13,5,23],[6,13,6,23],[7,13,7,14],[7,17,8,17],[5,25,5,35],[5,0,5,10],[7,25,7,26],[10,18,10,23],[11,18,11,23],[12,18,12,23],[13,18,13,23],[14,18,14,23],[7,18,8,23],[10,25,10,26],[8,40,8,41],[9,42,9,43],[9,40,9,41],[8,42,8,43],[71,14,72,19],[72,22,73,27],[71,6,72,12],[9,18,9,23],[20,25,20,35],[22,42,22,43],[23,42,23,43],[20,42,21,43],[20,40,21,41],[15,40,15,41],[10,40,11,41],[13,42,13,43],[13,40,13,41],[12,42,12,43],[17,30,17,35],[11,25,12,26],[13,25,13,26],[14,25,14,26],[8,27,8,28],[9,27,9,28],[15,45,15,51],[35,14,37,16],[35,17,37,17],[35,18,37,18],[35,19,37,19],[35,13,37,13],[36,38,37,38],[36,37,37,37],[36,33,37,35],[36,36,37,36],[20,44,20,45],[18,30,18,35],[19,30,19,35],[21,29,21,30],[21,31,21,32],[31,0,32,20],[23,6,23,10],[23,21,23,23],[16,0,16,1],[19,4,19,10],[17,4,17,10],[18,4,18,10],[15,13,15,23],[16,13,16,14],[10,30,10,35],[11,30,11,35],[12,30,12,35],[13,30,13,35],[14,30,14,35],[7,30,8,35],[9,30,9,35],[16,30,16,35],[121,6,122,12],[121,13,122,19],[121,20,122,26],[24,6,24,10],[27,0,28,12],[71,0,72,4],[121,0,122,5],[99,6,100,10],[98,14,99,18],[98,22,99,26],[7,27,7,28],[10,27,10,28],[13,27,13,28],[14,27,14,28],[8,25,8,26],[10,0,10,1],[16,45,16,51],[17,45,17,51],[18,45,18,51],[23,15,23,16],[24,15,24,16],[23,27,23,28],[24,27,24,28],[22,48,22,51],[23,48,23,51],[24,21,24,23]]}
[]
[]
[]
[]
[null,"Translate research into private practice"]
["Intial assessment",null,null,null,null,null,null,null,null,null,null,null,null,"Post intervention testing 1",null,null,null,null,null,null,null,null,null,null,null,"Post treatrment test 2",null,null,null,null,null,null,null,null,null,null,null,null,null,null," Patient Demographics"]
[" Patient Demographics",null,null,null,null,null,null,null,null,null,null,null,null," Patient Demographics",null,null,null,null,null,null,null,null,null,null,null," Patient Demographics",null,null,null,null,null,null,null,null,null,null,null,null,null,null,"Initial assesment ",null,2,null," Clinical summary"]
["Initial assesment ",null,1,null," Clinical summary",null,null,null,null,null,null,null,null,"Initial assesment ",null,2,null,"History:",{"$f":"F9","v":"Jan was operated on the 12the of April, and with ACLR"},null,null,null,null,null,null,{"$f":"A8","v":"Initial assesment "},null,{"$f":"C8","v":1},null,{"$f":"E9","v":"History:"},{"$f":"F9","v":"Jan was operated on the 12the of April, and with ACLR"},null,null,null,null,null,null,null,null,null,"Date:",null,"2022-06-05",null,{"$f":"AD8","v":"History:"},{"$f":"AE8","v":"Jan was operated on the 12the of April, and with ACLR"}]
["Date:",null,"2022-06-05",null,"History:","Jan was operated on the 12the of April, and with ACLR",null,null,null,null,null,null,null,"Date:",null,null,null,null,null,null,null,null,null,null,null,{"$f":"A9","v":"Date:"},null,null,null,null,null,null,null,null,null,null,null,null,null,null,"Name & Surname:",null,"Koos",null,{"$f":"AD10","v":"Current Progress"}]
["Name & Surname:",null,"Koos",null,null,null,null,null,null,null,null,null,null,"Name & Surname:",null,{"$f":"C10","v":"Koos"},null,"Current Progress",null,null,null,null,null,null,null,{"$f":"A10","v":"Name & Surname:"},null,"Koos",null,"Current Progress",null,null,null,null,null,null,null,null,null,null,"Field",null,"Orthopeadic",null,"Clinical symptoms:",{"$f":"AE11","v":"Patella femoral pain "}]
["Field",null,"Orthopeadic",null,"Clinical symptoms:","Patella femoral pain ",null,null,null,null,null,null,null,"Field",null,"Orthopeadic",null,"Clinical symptoms:",{"$f":"F11","v":"Patella femoral pain "},null,null,null,null,null,null,{"$f":"A11","v":"Field"},null,"Orthopeadic",null,{"$f":"E11","v":"Clinical symptoms:"},{"$f":"S11","v":"Patella femoral pain "},null,null,null,null,null,null,null,null,null,"Diagnose: ",null,"Primary","Secondary","Current intervention:",{"$f":"AE12","v":"Exercise rehabilitation"}]
["Diagnose: ",null,"Primary","Secondary","Current intervention:","Exercise rehabilitation",null,null,null,null,null,null,null,"Diagnose: ",null,"Primary","Secondary","Current intervention:",{"$f":"F12","v":"Exercise rehabilitation"},null,null,null,null,null,null,{"$f":"A12","v":"Diagnose: "},null,"Primary",{"$f":"D12","v":"Secondary"},{"$f":"E12","v":"Current intervention:"},{"$f":"S12","v":"Exercise rehabilitation"},null,null,null,null,null,null,null,null,null,null,null,"ACLR","nslbp","Clinician Involve:","Marinelle(Biokineticist)"]
[null,null,"ACLR","NSLBP","Clinician Involve:","Marinelle(Biokineticist)",null,null,null,null,null,null,null,null,null,{"$f":"C13","v":"ACLR"},{"$f":"D13","v":"NSLBP"},"Clinician Involve:","Marinelle(Biokineticist)",null,null,null,null,null,null,null,null,"ACLR",{"$f":"D13","v":"NSLBP"},{"$f":"E13","v":"Clinician Involve:"},"Marinelle(Biokineticist)",null,null,null,null,null,null,null,null,null,"Months/weeks after injury",null,"5 months",null,"Primary treatment","Exercise rehabilitation"]
["Months/weeks after injury",null,"5 months",null,"Projected plan:","Exercise rehabilitation",null,null,null,null,null,null,null,"Months/weeks after injury",null,{"$f":"C14","v":"5 months"},null,"Primary treatment","Exercise rehabilitation",null,null,null,null,null,null,{"$f":"A14","v":"Months/weeks after injury"},null,"5 months",null,"Primary treatment","Exercise rehabilitation",null,null,null,null,null,null,null,null,null,"Patient Goal",null,"Performance",null,"Timeframe:","3 months"]
["Patient Goal",null,"Performance",null,"Timeframe:","3 months",null,null,null,null,null,null,null,"Patient Goal",null,{"$f":"C15","v":"Performance"},null,"Timeframe:","3 months",null,null,null,null,null,null,{"$f":"A15","v":"Patient Goal"},null,"Performance",null,{"$f":"E15","v":"Timeframe:"},"3 months",null,null,null,null,null,null,null,null,null,"Patient Reported Outcomes Measures (PROM)"]
["Patient Reported Outcomes Measures (PROM)",null,null,null,null,null,null,null,null,null,null,null,null,"Patient Reported Outcomes Measures (PROM)",null,null,null,null,null,null,null,null,null,null,null,"Patient Reported Outcomes Measures (PROM)",null,null,null,null,null,null,null,null,null,null,null,null,null,null," Subjective Scoring Sheet",null,"Prevouis Score","Current  Score","Bench mark ","Comments"]
[" Subjective Scoring Sheet",null,"Current score ","Bench mark ","Comments",null,null,null,null,null,null,null,null,{"$f":"A17","v":" Subjective Scoring Sheet"},null,"Initial Ass","Current Score","Bench mark ","Comments",null,null,null,null,null,null," Subjective Scoring Sheet",null,"Current Score","Initial Ass","Bench mark ","Comments",null,null,null,null,null,null,null,null,null,"Discharge ",{"$f":"AA18","v":"MTSS"},0.87,null,{"$f":"D18","v":0},{"$f":"AE18","v":"Graph 1 summarizes the subjective improvement of(….%) over the exercise rehabilitation period. Currently, Mr. Potgieter achieved 66% (Benchmark 89%)"}]
["Initial Eval","MTSS",null,null,"Graph 1 represents the subjective results(…%) of ….......An estamted benchmark(..) were selected based on his end goals.",null,null,null,null,null,null,null,null,"Post Intervetion 1",{"$f":"B18","v":"MTSS"},0,0.67,{"$f":"D18","v":0},"Graph 1 summarizes the subjective improvement of(….%) over the exercise rehabilitation period. Currently, Mr. Potgieter achieved 66% (Benchmark 89%)",null,null,null,null,null,null,"Post Interv 2",{"$f":"B18","v":"MTSS"},0.87,{"$f":"C18","v":0},0,{"$f":"S18","v":"Graph 1 summarizes the subjective improvement of(….%) over the exercise rehabilitation period. Currently, Mr. Potgieter achieved 66% (Benchmark 89%)"},null,null,null,null,null,null,null,null,null,"Discharge ","IKDC",0.88,null,{"$f":"D19","v":0},{"$f":"AE19","v":"Graph 2 summarizes the subjective improvement of(….%) over the exercise rehabilitation period. Currently, Mr. Potgieter achieved 66% (Benchmark 89%)"}]
["Initial Eval","IKDC",null,null,"Graph 2 represents the subjective results(…%) of ….......An estamted benchmark(..) were selected based on his end goals.",null,null,null,null,null,null,null,null,"Post Intervetion 1","IKDC",0,0.6,0,"Graph 2 summarizes the subjective improvement of(….%) over the exercise rehabilitation period. Currently, Mr. Potgieter achieved 66% (Benchmark 89%)",null,null,null,null,null,null,"Post Interv 2",{"$f":"B19","v":"IKDC"},0.88,0,0,"Graph 2 summarizes the subjective improvement of(….%) over the exercise rehabilitation period. Currently, Mr. Potgieter achieved 66% (Benchmark 89%)",null,null,null,null,null,null,null,null,null,"Discharge ","Hagos",0.8,null,{"$f":"D20","v":0},"Graph 3 summarizes the subjective improvement of (….%) over the exercise rehabilitation period. Currently, Mr. Potgieter achieved 66% (Benchmark 89%)"]
["Initial Eval","Hagos",null,null,"Graph 3 represents the subjective results(…%) of ….......An estamted benchmark(..) were selected based on his end goals.",null,null,null,null,null,null,null,null,"Post Intervetion 1","Hagos",0,0.76,0,"Graph 3 summarizes the subjective improvement of (….%) over the exercise rehabilitation period. Currently, Mr. Potgieter achieved 66% (Benchmark 89%)",null,null,null,null,null,null,"Post Interv 2",{"$f":"B20","v":"Hagos"},0.8,0,0,"Graph 3 summarizes the subjective improvement of (….%) over the exercise rehabilitation period. Currently, Mr. Potgieter achieved 66% (Benchmark 89%)",null,null,null,null,null,null,null,null,null,"Patient Reported VAS Pain "]
["Patient Reported VAS Pain ",null,null,null,null,null,null,null,null,null,null,null,null,"Patient Reported VAS Pain ",null,null,null,null,null,null,null,null,null,null,null,"Patient Reported VAS Pain ",null,null,null,null,null,null,null,null,null,null,null,null,null,null," Pain Outcome measure during activity or rest",null,"Location/area/referred",null,"Prevouis ",null,"Current",null,"Comments"]
[" Pain Outcome measure during activity or rest",null,"Location/area/referred",null,"Current",null,"Comments",null,null,null,null,null,null," Pain Outcome measure during activity or rest",null,"Location/area/referred",null,"Initial ass(Pain)",null,"Current Status",null,"Comments",null,null,null," Pain Outcome measure during activity or rest",null,"Location/area/referred",null,"Prevouis Score",null,"Current",null,"Comments",null,null,null,null,null,null,null,null,null,null,"Involved (/10)","Uninvolved(/10)","Involved (/10)","Uninvolved(/10)"]
[null,null,null,null,"Involved (/10)","Uninvolved(/10)",null,null,null,null,null,null,null,null,null,null,null,"Involved (/10)","Uninvolved(/10)","Involve","Uninvolve",null,null,null,null,null,null,null,null,"Involved (/10)","Uninvolved(/10)","Involved (/10)","Uninvolved(/10)",null,null,null,null,null,null,null,"Initial",{"$f":"AA24","v":"Running @ 10 min"},{"$f":"AB24","v":"Patellar tendon"},null,{"$f":"AD24","v":3},0,1,0,{"$f":"AH24","v":"Graph 1 indicates a decline(-5) in patella tendon pain to a 2/10 while running 10 minutes."}]
["Initial","Running @ 10 min","Patellar tendon",null,null,0,"Graph 1 indicates a 5 in patella tendon pain while running 10 minutes",null,null,null,null,null,null,"Post Intv 1",{"$f":"B24","v":"Running @ 10 min"},{"$f":"C24","v":"Patellar tendon"},null,{"$f":"E24","v":0},0,3,0,"Graph 1 indicates a decline(-5) in patella tendon pain to a 2/10 while running 10 minutes.",null,null,null,"Post Interv 2",{"$f":"B24","v":"Running @ 10 min"},{"$f":"C24","v":"Patellar tendon"},null,{"$f":"T24","v":3},0,1,0,{"$f":"V24","v":"Graph 1 indicates a decline(-5) in patella tendon pain to a 2/10 while running 10 minutes."},null,null,null,null,null,null,"Initial",{"$f":"AA25","v":"One leg squad"},{"$f":"AB25","v":"Patellar tendon"},null,{"$f":"AD25","v":2},0,1,0,{"$f":"AH25","v":"Graph 2 indicates a decline(-6) in patella tendon pain to a 2/10 while doing squad manoeuver"}]
["Initial","One leg squad","Patellar tendon",null,null,0,"Graph 2 indicates a 4 in patella tendon pain while doing a single leg squad.",null,null,null,null,null,null,"Post Intv 1","One leg squad","Patellar tendon",null,0,0,2,0,"Graph 2 indicates a decline(-6) in patella tendon pain to a 2/10 while doing squad manoeuver",null,null,null,"Post Interv 2",{"$f":"B25","v":"One leg squad"},{"$f":"C25","v":"Patellar tendon"},null,{"$f":"T25","v":2},0,1,0,{"$f":"V25","v":"Graph 2 indicates a decline(-6) in patella tendon pain to a 2/10 while doing squad manoeuver"}]
[]
[]
["Start at INITIAL for FIRST ASSESSMENT"]
[null,null,null,null,null,null,null,null,null,null,null,null,null,0.8]
[]
[null,null,null,null,null,null,null,null,"Factor",0.9,1]
["Move to Progress 1 if not first assessment ----> --------------------->---------------------->-------------",null,null,null,null,null,null,null,null,null,null,null,null,null,null,null,null,null,null,null,null,"Move to progress 2 if progression made for final evaluation ---->-------------->------------->"]
[]
[]
[]
["INITIAL",null,"Performance Based Outcomes Measures (PBOM)-Unilateral",null,null,null,null,null,null,null,null,null,null,"Test 1 Results ","Post treatment test 1",null,null,"Comparison","Difference","Test results","Progress 1",null,null,null,null,null,null,null,null,null,null,null,null,null,null,null,null,null,null,"Progress 2"]
[null,null,"Musculoskeletal outcomes",null,"Test descriptor","Equipment","Injured","Uninjured ","Bench mark","Benchmark","Comparisons","Difference","Target",null,null,null,null,null,null,null,null,"Musculoskeletal outcomes",null,"Test descriptor","Equipment","Injured","Uninjured ","Bench mark","Benchmark","Comparisons","Difference","Target","TEST 2 RESULTS","Post treatment test 2",null,null,"Comparson","Difference","Test reults",null,"Musculoskeletal outcomes",null,"Test descriptor","Equipment","Injured","Uninjured ","Bench mark","Benchmark","Comparisons","Difference","Target",null,"Post treatment Discharge",null,null,"Comparison","Results","Test 4 results"]
[null,null,null,null,null,"Metric",null,null,null,null,null,null," Performance Deficit",null,null,null,null,null,null,null,null,null,null,null,"Metric",null,null,null,null,null,null," Performance Deficit",null,null,null,null,null,null,null,null,null,null,null,"Metric",null,null,null,null,null,null," Performance Deficit","Test 3 Results"]
[null,null,"Initial Eval",null,null,"Goniometre",null,null,null,{"$f":"IF(I39>0,I39,H39)","v":0},{"$f":"IF(OR(AND((H39/J39>$J$31),H39/J39<$K$31),I39=0), \"Injured vs uninjured\", \"Injured vs benchmark\")","v":{"$error":"#DIV/0!"}},{"$f":"IF(K39=\"Injured vs uninjured\", G39/H39,G39/J39)","v":{"$error":"#DIV/0!"}},0.9,{"$f":"IF(L39>=85%,\"Pass\",IF(L39<85%,\"Fail\",\"Error\"))","v":{"$error":"#DIV/0!"}},"Injured","Uninjured","Benchmark",{"$f":"IF(OR(AND((P40/Q40>$J$31),P40/Q40<$K$31),I39=0), \"Injured vs uninjured\", \"Injured vs benchmark\")","v":{"$error":"#DIV/0!"}},{"$f":"IF(R39=\"Injured vs uninjured\", O40/P40,O40/Q40)","v":{"$error":"#DIV/0!"}},{"$f":"IF(S39>=85%,\"Pass\",IF(S39<85%,\"Fail\",\"Error\"))","v":{"$error":"#DIV/0!"}},null,"Progress 1  ",null,null,"Biodex",null,null,null,{"$f":"IF(AB39>0,AB39,AA39)","v":0},{"$f":"IF(OR(AND((AA39/AC39>$J$31),AA39/AC39<$K$31),AB39=0), \"Injured vs uninjured\", \"Injured vs benchmark\")","v":{"$error":"#DIV/0!"}},{"$f":"IF(AD39=\"Injured vs uninjured\", Z39/AA39,Z39/AC39)","v":{"$error":"#DIV/0!"}},1,{"$f":"IF(AE39>=85%,\"Pass\",IF(AE39<85%,\"Fail\",\"Error\"))","v":{"$error":"#DIV/0!"}},"Injured","Uninjured","Benchmark",{"$f":"IF(OR(AND((AI40/AJ40>$J$31),AI40/AJ40<$K$31),AC39=0), \"Injured vs uninjured\", \"Injured vs benchmark\")","v":{"$error":"#DIV/0!"}},{"$f":"IF(AK39=\"Injured vs Uninjured\", AH40/AI40,AH40/AC39)","v":{"$error":"#DIV/0!"}},{"$f":"IF(AL39>=85%,\"Pass\",IF(AL39<85%,\"Fail\",\"Error\"))","v":{"$error":"#DIV/0!"}},null,"Discharge",null,null,"Stopwatch",null,null,null,{"$f":"IF(AU39>0,AU39,AT39)","v":0},{"$f":"IF(OR(AND((AT39/AV39>$J$31),AT39/AV39<$K$31),AU39=0), \"Injured vs uninjured\", \"Injured vs benchmark\")","v":{"$error":"#DIV/0!"}},{"$f":"IF(AW39=\"Injured vs Uninjured\", AS39/AT39,AS39/AV39)","v":{"$error":"#DIV/0!"}},1,{"$f":"IF(AX39>=85%,\"Pass\",IF(AX39<85%,\"Fail\",\"Error\"))","v":{"$error":"#DIV/0!"}},"Injured","Uninjured","Benchmark",{"$f":"IF(OR(AND((BB40/BC40>$J$31),BB40/BC40<$K$31),AV39=0), \"Injured vs uninjured\", \"Injured vs benchmark\")","v":{"$error":"#DIV/0!"}},{"$f":"IF(BD39=\"Injured vs Uninjured\", BA40/BB40,BA40/BC40)","v":{"$error":"#DIV/0!"}},{"$f":"IF(BE39>=85%,\"Pass\",IF(AX39<85%,\"Fail\",\"Error\"))","v":{"$error":"#DIV/0!"}}]
[null,null,null,null,null,"Degrees",null,null,null,null,null,null,{"$f":"L39-M39","v":{"$error":"#DIV/0!"}},null,{"$f":"IF(N39=\"pass\",G39,\"Enter New Value\")","v":{"$error":"#DIV/0!"}},{"$f":"IF(N39=\"pass\",H39,\"Enter New Value\")","v":{"$error":"#DIV/0!"}},{"$f":"IF(E39=\"\",\"Ignore\",IF(K39=\"Injured vs Uninjured\",J39,J39))","v":"Ignore"},null,null,null,null,null,null,null,"Nm",null,null,null,null,null,null,{"$f":"AE39-AF39","v":{"$error":"#DIV/0!"}},null,{"$f":"IF(AG39=\"pass\",Z39,\"Enter New Value\")","v":{"$error":"#DIV/0!"}},{"$f":"IF(AG39=\"pass\",AA39,\"Enter New Value\")","v":{"$error":"#DIV/0!"}},{"$f":"IF(X39=\"\",\"Ignore\",IF(AD39=\"Injured vs Uninjured\",AC39,AC39))","v":"Ignore"},null,null,null,null,null,null,null,"Seconds",null,null,null,null,null,null,{"$f":"AX39-AY39","v":{"$error":"#DIV/0!"}},null,{"$f":"IF(AZ39=\"Pass\",AS39,\"Enter New Value\")","v":{"$error":"#DIV/0!"}},{"$f":"IF(AZ39=\"Pass\",AT39,\"Enter New Value\")","v":{"$error":"#DIV/0!"}},{"$f":"IF(X39=\"Enter New Value\",\"Ignore\",IF(AW39=\"Injured vs Uninjured\",AT39,AV39))","v":{"$error":"#DIV/0!"}}]
[null,null,{"$f":"C39","v":"Initial Eval"},null,null,"Goniometre",null,null,null,{"$f":"IF(I41>0,I41,H41)","v":0},{"$f":"IF(OR(AND((H41/J41>$J$31),H41/J41<$K$31),I41=0), \"Injured vs uninjured\", \"Injured vs benchmark\")","v":{"$error":"#DIV/0!"}},{"$f":"IF(K41=\"Injured vs uninjured\", G41/H41,G41/J41)","v":{"$error":"#DIV/0!"}},0.9,{"$f":"IF(L41>=85%,\"Pass\",IF(L41<85%,\"Fail\",\"Error\"))","v":{"$error":"#DIV/0!"}},{"$f":"O39","v":"Injured"},{"$f":"P39","v":"Uninjured"},{"$f":"Q39","v":"Benchmark"},{"$f":"IF(OR(AND((P42/Q42>$J$31),P42/Q42<$K$31),I41=0), \"Injured vs uninjured\", \"Injured vs benchmark\")","v":{"$error":"#DIV/0!"}},{"$f":"IF(R41=\"Injured vs uninjured\", O42/P42,O42/Q42)","v":{"$error":"#DIV/0!"}},{"$f":"IF(S41>=85%,\"Pass\",IF(S41<85%,\"Fail\",\"Error\"))","v":{"$error":"#DIV/0!"}},null,{"$f":"V39","v":"Progress 1  "},null,null,"Biodex",null,null,null,{"$f":"IF(AB41>0,AB41,AA41)","v":0},{"$f":"IF(OR(AND((AA41/AC41>$J$31),AA41/AC41<$K$31),AB41=0), \"Injured vs uninjured\", \"Injured vs benchmark\")","v":{"$error":"#DIV/0!"}},{"$f":"IF(AD41=\"Injured vs uninjured\", Z41/AA41,Z41/AC41)","v":{"$error":"#DIV/0!"}},1,{"$f":"IF(AE41>=85%,\"Pass\",IF(AE41<85%,\"Fail\",\"Error\"))","v":{"$error":"#DIV/0!"}},"Injured",{"$f":"AI39","v":"Uninjured"},{"$f":"AJ39","v":"Benchmark"},{"$f":"IF(OR(AND((AI42/AJ42>$J$31),AI42/AJ42<$K$31),AC41=0), \"Injured vs uninjured\", \"Injured vs benchmark\")","v":{"$error":"#DIV/0!"}},{"$f":"IF(AK41=\"Injured vs Uninjured\", AH42/AI42,AH42/AC41)","v":{"$error":"#DIV/0!"}},{"$f":"IF(AL41>=85%,\"Pass\",IF(AL41<85%,\"Fail\",\"Error\"))","v":{"$error":"#DIV/0!"}},null,"Discharge",null,null,"Stopwatch",null,null,null,{"$f":"IF(AU41>0,AU41,AT41)","v":0},{"$f":"IF(OR(AND((AT41/AV41>$J$31),AT41/AV41<$K$31),AU41=0), \"Injured vs uninjured\", \"Injured vs benchmark\")","v":{"$error":"#DIV/0!"}},{"$f":"IF(AW41=\"Injured vs Uninjured\", AS41/AT41,AS41/AV41)","v":{"$error":"#DIV/0!"}},0.95,{"$f":"IF(AX41>=85%,\"Pass\",IF(AX41<85%,\"Fail\",\"Error\"))","v":{"$error":"#DIV/0!"}},{"$f":"BA39","v":"Injured"},{"$f":"BB39","v":"Uninjured"},{"$f":"BC39","v":"Benchmark"},{"$f":"IF(OR(AND((BB42/BC42>$J$31),BB42/BC42<$K$31),AV41=0), \"Injured vs uninjured\", \"Injured vs benchmark\")","v":{"$error":"#DIV/0!"}},{"$f":"IF(BD41=\"Injured vs Uninjured\", BA42/BB42,BA42/BC42)","v":{"$error":"#DIV/0!"}},{"$f":"IF(BE41>=85%,\"Pass\",IF(AX41<85%,\"Fail\",\"Error\"))","v":{"$error":"#DIV/0!"}}]
[null,null,null,null,null,"Degrees",null,null,null,null,null,null,{"$f":"L41-M41","v":{"$error":"#DIV/0!"}},null,{"$f":"IF(N41=\"pass\",G41,\"Enter New Value\")","v":{"$error":"#DIV/0!"}},{"$f":"IF(N41=\"pass\",H41,\"Enter New Value\")","v":{"$error":"#DIV/0!"}},{"$f":"IF(E41=\"\",\"Ignore\",IF(K41=\"Injured vs Uninjured\",J41,J41))","v":"Ignore"},null,null,null,null,null,null,null,"Kg",null,null,null,null,null,null,{"$f":"AE41-AF41","v":{"$error":"#DIV/0!"}},null,{"$f":"IF(AG41=\"pass\",Z41,\"Enter New Value\")","v":{"$error":"#DIV/0!"}},{"$f":"IF(AG41=\"pass\",AA41,\"Enter New Value\")","v":{"$error":"#DIV/0!"}},{"$f":"IF(X41=\"\",\"Ignore\",IF(AD41=\"Injured vs Uninjured\",AC41,AC41))","v":"Ignore"},null,null,null,null,null,null,null,"Joule",null,null,null,null,null,null,{"$f":"AX41-AY41","v":{"$error":"#DIV/0!"}},null,{"$f":"IF(AZ41=\"Pass\",AS41,\"Enter New Value\")","v":{"$error":"#DIV/0!"}},{"$f":"IF(AZ41=\"Pass\",AT41,\"Enter New Value\")","v":{"$error":"#DIV/0!"}},{"$f":"IF(X39=\"Enter New Value\",\"Ignore\",IF(AW41=\"Injured vs Uninjured\",AT41,AV41))","v":{"$error":"#DIV/0!"}}]
[null,null,{"$f":"C41","v":"Initial Eval"},null,null,"MicroFit/Biofet",null,null,null,{"$f":"IF(I43>0,I43,H43)","v":0},{"$f":"IF(OR(AND((H43/J43>$J$31),H43/J43<$K$31),I43=0), \"Injured vs uninjured\", \"Injured vs benchmark\")","v":{"$error":"#DIV/0!"}},{"$f":"IF(K43=\"Injured vs uninjured\", G43/H43,G43/J43)","v":{"$error":"#DIV/0!"}},0.9,{"$f":"IF(L43>=85%,\"Pass\",IF(L43<85%,\"Fail\",\"Error\"))","v":{"$error":"#DIV/0!"}},{"$f":"O41","v":"Injured"},"Uninjured",{"$f":"Q41","v":"Benchmark"},{"$f":"IF(OR(AND((P44/Q44>$J$31),P44/Q44<$K$31),I43=0), \"Injured vs uninjured\", \"Injured vs benchmark\")","v":{"$error":"#DIV/0!"}},{"$f":"IF(R43=\"Injured vs uninjured\", O44/P44,O44/Q44)","v":{"$error":"#DIV/0!"}},{"$f":"IF(S43>=85%,\"Pass\",IF(S43<85%,\"Fail\",\"Error\"))","v":{"$error":"#DIV/0!"}},null,{"$f":"V41","v":"Progress 1  "},null,null,"DynoMo",null,null,null,{"$f":"IF(AB43>0,AB43,AA43)","v":0},{"$f":"IF(OR(AND((AA43/AC43>$J$31),AA43/AC43<$K$31),AB43=0), \"Injured vs uninjured\", \"Injured vs benchmark\")","v":{"$error":"#DIV/0!"}},{"$f":"IF(AD43=\"Injured vs uninjured\", Z43/AA43,Z43/AC43)","v":{"$error":"#DIV/0!"}},1,{"$f":"IF(AE43>=85%,\"Pass\",IF(AE43<85%,\"Fail\",\"Error\"))","v":{"$error":"#DIV/0!"}},"Injured",{"$f":"AI41","v":"Uninjured"},{"$f":"AJ41","v":"Benchmark"},{"$f":"IF(OR(AND((AI44/AJ44>$J$31),AI44/AJ44<$K$31),AC43=0), \"Injured vs uninjured\", \"Injured vs benchmark\")","v":{"$error":"#DIV/0!"}},{"$f":"IF(AK43=\"Injured vs Uninjured\", AH44/AI44,AH44/AC43)","v":{"$error":"#DIV/0!"}},{"$f":"IF(AL43>=85%,\"Pass\",IF(AL43<85%,\"Fail\",\"Error\"))","v":{"$error":"#DIV/0!"}},null,"Discharge",null,null,"MicroFit/Biofet",null,null,null,{"$f":"IF(AU43>0,AU43,AT43)","v":0},{"$f":"IF(OR(AND((AT43/AV43>$J$31),AT43/AV43<$K$31),AU43=0), \"Injured vs uninjured\", \"Injured vs benchmark\")","v":{"$error":"#DIV/0!"}},{"$f":"IF(AW43=\"Injured vs Uninjured\", AS43/AT43,AS43/AV43)","v":{"$error":"#DIV/0!"}},0.95,{"$f":"IF(AX43>=85%,\"Pass\",IF(AX43<85%,\"Fail\",\"Error\"))","v":{"$error":"#DIV/0!"}},{"$f":"BA41","v":"Injured"},"Uninjured","Benchmark",{"$f":"IF(OR(AND((BB44/BC44>$J$31),BB44/BC44<$K$31),AV43=0), \"Injured vs uninjured\", \"Injured vs benchmark\")","v":{"$error":"#DIV/0!"}},{"$f":"IF(BD43=\"Injured vs Uninjured\", BA44/BB44,BA44/BC44)","v":{"$error":"#DIV/0!"}},{"$f":"IF(BE43>=85%,\"Pass\",IF(AX43<85%,\"Fail\",\"Error\"))","v":{"$error":"#DIV/0!"}}]
[null,null,null,null,null,"Joule",null,null,null,null,null,null,{"$f":"L43-M43","v":{"$error":"#DIV/0!"}},null,{"$f":"IF(N43=\"pass\",G43,\"Enter New Value\")","v":{"$error":"#DIV/0!"}},{"$f":"IF(N43=\"pass\",H43,\"Enter New Value\")","v":{"$error":"#DIV/0!"}},{"$f":"IF(E43=\"\",\"Ignore\",IF(K43=\"Injured vs Uninjured\",J43,J43))","v":"Ignore"},null,null,null,null,null,null,null,"Joule",null,null,null,null,null,null,{"$f":"AE43-AF43","v":{"$error":"#DIV/0!"}},null,{"$f":"IF(AG43=\"pass\",Z43,\"Enter New Value\")","v":{"$error":"#DIV/0!"}},{"$f":"IF(AG43=\"pass\",AA43,\"Enter New Value\")","v":{"$error":"#DIV/0!"}},{"$f":"IF(X43=\"\",\"Ignore\",IF(AD43=\"Injured vs Uninjured\",AC43,AC43))","v":"Ignore"},null,null,null,null,null,null,null,"Joule",null,null,null,null,null,null,{"$f":"AX43-AY43","v":{"$error":"#DIV/0!"}},null,{"$f":"IF(AZ43=\"Pass\",AS43,\"Enter New Value\")","v":{"$error":"#DIV/0!"}},{"$f":"IF(AZ43=\"Pass\",AT43,\"Enter New Value\")","v":{"$error":"#DIV/0!"}},{"$f":"IF(X39=\"Enter New Value\",\"Ignore\",IF(AW43=\"Injured vs Uninjured\",AT43,AV43))","v":{"$error":"#DIV/0!"}}]
[null,null,{"$f":"C43","v":"Initial Eval"},null,null,"Step",null,null,null,{"$f":"IF(I45>0,I45,H45)","v":0},{"$f":"IF(OR(AND((H45/J45>$J$31),H45/J45<$K$31),I45=0), \"Injured vs uninjured\", \"Injured vs benchmark\")","v":{"$error":"#DIV/0!"}},{"$f":"IF(K45=\"Injured vs uninjured\", G45/H45,G45/J45)","v":{"$error":"#DIV/0!"}},1,{"$f":"IF(L45>=85%,\"Pass\",IF(L45<85%,\"Fail\",\"Error\"))","v":{"$error":"#DIV/0!"}},{"$f":"O43","v":"Injured"},"Uninjured","Benchmark",{"$f":"IF(OR(AND((P46/Q46>$J$31),P46/Q46<$K$31),I45=0), \"Injured vs uninjured\", \"Injured vs benchmark\")","v":{"$error":"#DIV/0!"}},{"$f":"IF(R45=\"Injured vs uninjured\", O46/P46,O46/Q46)","v":{"$error":"#DIV/0!"}},{"$f":"IF(S45>=85%,\"Pass\",IF(S45<85%,\"Fail\",\"Error\"))","v":{"$error":"#DIV/0!"}},null,{"$f":"V43","v":"Progress 1  "},null,null,"MicroFit/Biofet",null,null,null,{"$f":"IF(AB45>0,AB45,AA45)","v":0},{"$f":"IF(OR(AND((AA45/AC45>$J$31),AA45/AC45<$K$31),AB45=0), \"Injured vs uninjured\", \"Injured vs benchmark\")","v":{"$error":"#DIV/0!"}},{"$f":"IF(AD45=\"Injured vs uninjured\", Z45/AA45,Z45/AC45)","v":{"$error":"#DIV/0!"}},1,{"$f":"IF(AE45>=85%,\"Pass\",IF(AE45<85%,\"Fail\",\"Error\"))","v":{"$error":"#DIV/0!"}},"Injured",{"$f":"AI41","v":"Uninjured"},{"$f":"AJ43","v":"Benchmark"},{"$f":"IF(OR(AND((AI46/AJ46>$J$31),AI46/AJ46<$K$31),AC45=0), \"Injured vs uninjured\", \"Injured vs benchmark\")","v":{"$error":"#DIV/0!"}},{"$f":"IF(AK45=\"Injured vs Uninjured\", AH46/AI46,AH46/AC45)","v":{"$error":"#DIV/0!"}},{"$f":"IF(AL45>=85%,\"Pass\",IF(AL45<85%,\"Fail\",\"Error\"))","v":{"$error":"#DIV/0!"}},null,"Discharge",null,null,"MicroFit/Biofet",null,null,null,{"$f":"IF(AU45>0,AU45,AT45)","v":0},{"$f":"IF(OR(AND((AT45/AV45>$J$31),AT45/AV45<$K$31),AU45=0), \"Injured vs uninjured\", \"Injured vs benchmark\")","v":{"$error":"#DIV/0!"}},{"$f":"IF(AW45=\"Injured vs Uninjured\", AS45/AT45,AS45/AV45)","v":{"$error":"#DIV/0!"}},0.95,{"$f":"IF(AX45>=85%,\"Pass\",IF(AX45<85%,\"Fail\",\"Error\"))","v":{"$error":"#DIV/0!"}},{"$f":"BA43","v":"Injured"},"Uninjured","Benchmark",{"$f":"IF(OR(AND((BB46/BC46>$J$31),BB46/BC46<$K$31),AV45=0), \"Injured vs uninjured\", \"Injured vs benchmark\")","v":{"$error":"#DIV/0!"}},{"$f":"IF(BD45=\"Injured vs Uninjured\", BA46/BB46,BA46/BC46)","v":{"$error":"#DIV/0!"}},{"$f":"IF(BE45>=85%,\"Pass\",IF(AX45<85%,\"Fail\",\"Error\"))","v":{"$error":"#DIV/0!"}}]
[null,null,null,null,null,"Numeric value",null,null,null,null,null,null,{"$f":"L45-M45","v":{"$error":"#DIV/0!"}},null,{"$f":"IF(N45=\"pass\",G45,\"Enter New Value\")","v":{"$error":"#DIV/0!"}},{"$f":"IF(N45=\"pass\",H45,\"Enter New Value\")","v":{"$error":"#DIV/0!"}},{"$f":"IF(E45=\"\",\"Ignore\",IF(K45=\"Injured vs Uninjured\",H45,I45))","v":"Ignore"},null,null,null,null,null,null,null,"Joule",null,null,null,null,null,null,{"$f":"AE45-AF45","v":{"$error":"#DIV/0!"}},null,{"$f":"IF(AG45=\"pass\",Z45,\"Enter New Value\")","v":{"$error":"#DIV/0!"}},{"$f":"IF(AG45=\"pass\",AA45,\"Enter New Value\")","v":{"$error":"#DIV/0!"}},{"$f":"IF(X45=\"\",\"Ignore\",IF(AD45=\"Injured vs Uninjured\",AC45,AC45))","v":"Ignore"},null,null,null,null,null,null,null,"Joule",null,null,null,null,null,null,{"$f":"AX45-AY45","v":{"$error":"#DIV/0!"}},null,{"$f":"IF(AZ45=\"Pass\",AS45,\"Enter New Value\")","v":{"$error":"#DIV/0!"}},{"$f":"IF(AZ45=\"Pass\",AT45,\"Enter New Value\")","v":{"$error":"#DIV/0!"}},{"$f":"IF(X39=\"Enter New Value\",\"Ignore\",IF(AW45=\"Injured vs Uninjured\",AT45,AV45))","v":{"$error":"#DIV/0!"}}]
[null,null,{"$f":"C45","v":"Initial Eval"},null,null,"MicroFit/Biofet",null,null,null,{"$f":"IF(I47>0,I47,H47)","v":0},{"$f":"IF(OR(AND((H47/J47>$J$31),H47/J47<$K$31),I47=0), \"Injured vs uninjured\", \"Injured vs benchmark\")","v":{"$error":"#DIV/0!"}},{"$f":"IF(K47=\"Injured vs uninjured\", G47/H47,G47/J47)","v":{"$error":"#DIV/0!"}},1,{"$f":"IF(L47>=85%,\"Pass\",IF(L47<85%,\"Fail\",\"Error\"))","v":{"$error":"#DIV/0!"}},{"$f":"O45","v":"Injured"},"Uninjured","Benchmark",{"$error":"#DIV/0!"},{"$f":"IF(R47=\"Injured vs uninjured\", O48/P48,O48/Q48)","v":{"$error":"#DIV/0!"}},{"$f":"IF(S47>=85%,\"Pass\",IF(S47<85%,\"Fail\",\"Error\"))","v":{"$error":"#DIV/0!"}},null,{"$f":"V45","v":"Progress 1  "},null,null,"MicroFit/Biofet",null,null,null,{"$f":"IF(AB47>0,AB47,AA47)","v":0},{"$f":"IF(OR(AND((AA47/AC47>$J$31),AA47/AC47<$K$31),AB47=0), \"Injured vs uninjured\", \"Injured vs benchmark\")","v":{"$error":"#DIV/0!"}},{"$f":"IF(AD47=\"Injured vs uninjured\", Z47/AA47,Z47/AC47)","v":{"$error":"#DIV/0!"}},1,{"$f":"IF(AE47>=85%,\"Pass\",IF(AE47<85%,\"Fail\",\"Error\"))","v":{"$error":"#DIV/0!"}},"Injured",{"$f":"AI45","v":"Uninjured"},{"$f":"AJ45","v":"Benchmark"},{"$f":"IF(OR(AND((AI48/AJ48>$J$31),AI48/AJ48<$K$31),AC47=0), \"Injured vs uninjured\", \"Injured vs benchmark\")","v":{"$error":"#DIV/0!"}},{"$f":"IF(AK47=\"Injured vs Uninjured\", AH48/AI48,AH48/AC47)","v":{"$error":"#DIV/0!"}},{"$f":"IF(AL47>=85%,\"Pass\",IF(AL47<85%,\"Fail\",\"Error\"))","v":{"$error":"#DIV/0!"}},null,"Discharge",null,null,"MicroFit/Biofet",null,null,null,{"$f":"IF(AU47>0,AU47,AT47)","v":0},{"$f":"IF(OR(AND((AT47/AV47>$J$31),AT47/AV47<$K$31),AU47=0), \"Injured vs uninjured\", \"Injured vs benchmark\")","v":{"$error":"#DIV/0!"}},{"$f":"IF(AW47=\"Injured vs Uninjured\", AS47/AT47,AS47/AV47)","v":{"$error":"#DIV/0!"}},0.95,{"$f":"IF(AX47>=85%,\"Pass\",IF(AX47<85%,\"Fail\",\"Error\"))","v":{"$error":"#DIV/0!"}},{"$f":"BA45","v":"Injured"},"Uninjured","Benchmark",{"$f":"IF(OR(AND((BB48/BC48>$J$31),BB48/BC48<$K$31),AV47=0), \"Injured vs uninjured\", \"Injured vs benchmark\")","v":{"$error":"#DIV/0!"}},{"$f":"IF(BD47=\"Injured vs Uninjured\", BA48/BB48,BA48/BC48)","v":{"$error":"#DIV/0!"}},{"$f":"IF(BE47>=85%,\"Pass\",IF(AX47<85%,\"Fail\",\"Error\"))","v":{"$error":"#DIV/0!"}}]
[null,null,null,null,null,"Kg",null,null,null,null,null,null,{"$f":"L47-M47","v":{"$error":"#DIV/0!"}},null,{"$f":"IF(N47=\"pass\",G47,\"Enter New Value\")","v":{"$error":"#DIV/0!"}},{"$f":"IF(N47=\"pass\",H47,\"Enter New Value\")","v":{"$error":"#DIV/0!"}},{"$f":"IF(E47=\"\",\"Ignore\",IF(K47=\"Injured vs Uninjured\",J47,J47))","v":"Ignore"},null,null,null,null,null,null,null,"Joule",null,null,null,null,null,null,{"$f":"AE47-AF47","v":{"$error":"#DIV/0!"}},null,{"$f":"IF(AG47=\"pass\",Z47,\"Enter New Value\")","v":{"$error":"#DIV/0!"}},{"$f":"IF(AG47=\"pass\",AA47,\"Enter New Value\")","v":{"$error":"#DIV/0!"}},{"$f":"IF(X47=\"\",\"Ignore\",IF(AD47=\"Injured vs Uninjured\",AC47,AC47))","v":"Ignore"},null,null,null,null,null,null,null,"Joule",null,null,null,null,null,null,{"$f":"AX47-AY47","v":{"$error":"#DIV/0!"}},null,{"$f":"IF(AZ47=\"Pass\",AS47,\"Enter New Value\")","v":{"$error":"#DIV/0!"}},{"$f":"IF(AZ47=\"Pass\",AT47,\"Enter New Value\")","v":{"$error":"#DIV/0!"}},{"$f":"IF(X39=\"Enter New Value\",\"Ignore\",IF(AW47=\"Injured vs Uninjured\",AT47,AV47))","v":{"$error":"#DIV/0!"}}]
[null,null,{"$f":"C47","v":"Initial Eval"},null,null,"MicroFit/Biofet",null,null,null,{"$f":"IF(I49>0,I49,H49)","v":0},{"$f":"#REF!","v":{"$error":"#REF!"}},{"$f":"#REF!","v":{"$error":"#REF!"}},0.95,null,"Injured",null,"Uninjured",null,{"$f":"#REF!","v":{"$error":"#REF!"}},null,null,"Initial",{"$f":"D39","v":0},{"$f":"E39","v":0},{"$f":"F39","v":"Goniometre"},{"$f":"O40","v":{"$error":"#DIV/0!"}},{"$f":"P40","v":{"$error":"#DIV/0!"}},{"$f":"J39","v":0},{"$f":"IF(AB49>0,AB49,AA49)","v":{"$error":"#DIV/0!"}},{"$f":"IF(OR(AND((AA49/AC49>$J$31),AA49/AC49<$K$31),AB49=0), \"Injured vs uninjured\", \"Injured vs benchmark\")","v":{"$error":"#DIV/0!"}},{"$f":"IF(AD49=\"Injured vs uninjured\", Z49/AA49,Z49/AC49)","v":{"$error":"#DIV/0!"}},{"$f":"M39","v":0.9},{"$f":"IF(AE49>=85%,\"Pass\",IF(AE49<85%,\"Fail\",\"Error\"))","v":{"$error":"#DIV/0!"}},{"$f":"AH47","v":"Injured"},{"$f":"AI47","v":"Uninjured"},{"$f":"AJ47","v":"Benchmark"},{"$f":"IF(OR(AND((AI50/AJ50>$J$31),AI50/AJ50<$K$31),AC49=0), \"Injured vs uninjured\", \"Injured vs benchmark\")","v":{"$error":"#DIV/0!"}},{"$f":"IF(AK49=\"Injured vs Uninjured\", AH50/AI50,AH50/AC49)","v":{"$error":"#DIV/0!"}},{"$f":"IF(AL49>=85%,\"Pass\",IF(AL49<85%,\"Fail\",\"Error\"))","v":{"$error":"#DIV/0!"}},null,"Progress 1",{"$f":"W39","v":0},{"$f":"X39","v":0},{"$f":"Y39","v":"Biodex"},{"$f":"AH40","v":{"$error":"#DIV/0!"}},{"$f":"AI40","v":{"$error":"#DIV/0!"}},{"$f":"AC39","v":0},{"$f":"IF(AU49>0,AU49,AT49)","v":{"$error":"#DIV/0!"}},{"$f":"IF(OR(AND((AT49/AV49>$J$31),AT49/AV49<$K$31),AU49=0), \"Injured vs uninjured\", \"Injured vs benchmark\")","v":{"$error":"#DIV/0!"}},{"$f":"IF(AW49=\"Injured vs Uninjured\", AS49/AT49,AS49/AV49)","v":{"$error":"#DIV/0!"}},{"$f":"AF39","v":1},{"$f":"IF(AX49>=85%,\"Pass\",IF(AX49<85%,\"Fail\",\"Error\"))","v":{"$error":"#DIV/0!"}},{"$f":"BA47","v":"Injured"},"Uninjured","Benchmark",{"$f":"IF(OR(AND((BB50/BC50>$J$31),BB50/BC50<$K$31),AV49=0), \"Injured vs uninjured\", \"Injured vs benchmark\")","v":{"$error":"#DIV/0!"}},{"$f":"IF(BD49=\"Injured vs Uninjured\", BA50/BB50,BA50/BC50)","v":{"$error":"#DIV/0!"}},{"$f":"IF(BE49>=85%,\"Pass\",IF(AX49<85%,\"Fail\",\"Error\"))","v":{"$error":"#DIV/0!"}}]
[null,null,null,null,null,"Joule",null,null,null,null,null,null,{"$f":"L49-M49","v":{"$error":"#REF!"}},null,null,null,null,null,null,null,null,null,null,null,{"$f":"F40","v":"Degrees"},null,null,null,null,null,null,{"$f":"AE49-AF49","v":{"$error":"#DIV/0!"}},null,{"$f":"IF(AG49=\"pass\",Z49,\"Enter New Value\")","v":{"$error":"#DIV/0!"}},{"$f":"IF(AG49=\"pass\",AA49,\"Enter New Value\")","v":{"$error":"#DIV/0!"}},{"$f":"IF(X49=\"\",\"Ignore\",IF(AD49=\"Injured vs Uninjured\",AC49,AC49))","v":{"$error":"#DIV/0!"}},null,null,null,null,null,null,null,{"$f":"Y40","v":"Nm"},null,null,null,null,null,null,{"$f":"AX49-AY49","v":{"$error":"#DIV/0!"}},null,{"$f":"IF(AZ49=\"Pass\",AS49,\"Enter New Value\")","v":{"$error":"#DIV/0!"}},{"$f":"IF(AZ49=\"Pass\",AT49,\"Enter New Value\")","v":{"$error":"#DIV/0!"}},{"$f":"IF(X39=\"Enter New Value\",\"Ignore\",IF(AW49=\"Injured vs Uninjured\",AT49,AV49))","v":{"$error":"#DIV/0!"}}]
[null,null,{"$f":"C49","v":"Initial Eval"},null,null,"MicroFit/Biofet",null,null,null,{"$f":"IF(I51>0,I51,H51)","v":0},{"$f":"#REF!","v":{"$error":"#REF!"}},{"$f":"#REF!","v":{"$error":"#REF!"}},0.95,null,"Injured",null,"Uninjured",null,{"$f":"#REF!","v":{"$error":"#REF!"}},null,null,{"$f":"V49","v":"Initial"},{"$f":"D41","v":0},{"$f":"E41","v":0},"Goniometre",{"$f":"O42","v":{"$error":"#DIV/0!"}},{"$f":"P42","v":{"$error":"#DIV/0!"}},{"$f":"J41","v":0},{"$f":"IF(AB51>0,AB51,AA51)","v":{"$error":"#DIV/0!"}},{"$f":"IF(OR(AND((AA51/AC51>$J$31),AA51/AC51<$K$31),AB51=0), \"Injured vs uninjured\", \"Injured vs benchmark\")","v":{"$error":"#DIV/0!"}},{"$f":"IF(AD51=\"Injured vs uninjured\", Z51/AA51,Z51/AC51)","v":{"$error":"#DIV/0!"}},{"$f":"M41","v":0.9},{"$f":"IF(AE51>=85%,\"Pass\",IF(AE51<85%,\"Fail\",\"Error\"))","v":{"$error":"#DIV/0!"}},{"$f":"AH49","v":"Injured"},"Uninjured","Benchmark",{"$f":"IF(OR(AND((AI52/AJ52>$J$31),AI52/AJ52<$K$31),AC51=0), \"Injured vs uninjured\", \"Injured vs benchmark\")","v":{"$error":"#DIV/0!"}},{"$f":"IF(AK51=\"Injured vs Uninjured\", AH52/AI52,AH52/AC51)","v":{"$error":"#DIV/0!"}},{"$f":"IF(AL51>=85%,\"Pass\",IF(AL51<85%,\"Fail\",\"Error\"))","v":{"$error":"#DIV/0!"}},null,"Progress 1",{"$f":"W41","v":0},{"$f":"X41","v":0},"Biodex",{"$f":"AH42","v":{"$error":"#DIV/0!"}},{"$f":"AI42","v":{"$error":"#DIV/0!"}},{"$f":"AC41","v":0},{"$f":"IF(AU51>0,AU51,AT51)","v":{"$error":"#DIV/0!"}},{"$f":"IF(OR(AND((AT51/AV51>$J$31),AT51/AV51<$K$31),AU51=0), \"Injured vs uninjured\", \"Injured vs benchmark\")","v":{"$error":"#DIV/0!"}},{"$f":"IF(AW51=\"Injured vs Uninjured\", AS51/AT51,AS51/AV51)","v":{"$error":"#DIV/0!"}},{"$f":"AF41","v":1},{"$f":"IF(AX51>=85%,\"Pass\",IF(AX51<85%,\"Fail\",\"Error\"))","v":{"$error":"#DIV/0!"}},{"$f":"BA49","v":"Injured"},"Uninjured","Benchmark",{"$f":"IF(OR(AND((BB52/BC52>$J$31),BB52/BC52<$K$31),AV51=0), \"Injured vs uninjured\", \"Injured vs benchmark\")","v":{"$error":"#DIV/0!"}},{"$f":"IF(BD51=\"Injured vs Uninjured\", BA52/BB52,BA52/BC52)","v":{"$error":"#DIV/0!"}},{"$f":"IF(BE51>=85%,\"Pass\",IF(AX51<85%,\"Fail\",\"Error\"))","v":{"$error":"#DIV/0!"}}]
[null,null,null,null,null,"Joule",null,null,null,null,null,null,{"$f":"L51-M51","v":{"$error":"#REF!"}},null,null,null,null,null,null,null,null,null,null,null,"Degrees",null,null,null,null,null,null,{"$f":"AE51-AF51","v":{"$error":"#DIV/0!"}},null,{"$f":"IF(AG51=\"pass\",Z51,\"Enter New Value\")","v":{"$error":"#DIV/0!"}},{"$f":"IF(AG51=\"pass\",AA51,\"Enter New Value\")","v":{"$error":"#DIV/0!"}},{"$f":"IF(X51=\"\",\"Ignore\",IF(AD51=\"Injured vs Uninjured\",AC51,AC51))","v":{"$error":"#DIV/0!"}},null,null,null,null,null,null,null,"Kg",null,null,null,null,null,null,{"$f":"AX51-AY51","v":{"$error":"#DIV/0!"}},null,{"$f":"IF(AZ51=\"Pass\",AS51,\"Enter New Value\")","v":{"$error":"#DIV/0!"}},{"$f":"IF(AZ51=\"Pass\",AT51,\"Enter New Value\")","v":{"$error":"#DIV/0!"}},{"$f":"IF(X39=\"Enter New Value\",\"Ignore\",IF(AW51=\"Injured vs Uninjured\",AT51,AV51))","v":{"$error":"#DIV/0!"}}]
[null,null,{"$f":"C51","v":"Initial Eval"},null,null,"MicroFit/Biofet",null,null,null,{"$f":"IF(I53>0,I53,H53)","v":0},{"$f":"#REF!","v":{"$error":"#REF!"}},{"$f":"#REF!","v":{"$error":"#REF!"}},0.95,null,"Injured",null,"Uninjured",null,{"$f":"#REF!","v":{"$error":"#REF!"}},null,null,{"$f":"V51","v":"Initial"},{"$f":"D43","v":0},{"$f":"E43","v":0},"MicroFit/Biofet",{"$f":"O44","v":{"$error":"#DIV/0!"}},{"$f":"P44","v":{"$error":"#DIV/0!"}},{"$f":"J43","v":0},{"$f":"IF(AB53>0,AB53,AA53)","v":{"$error":"#DIV/0!"}},{"$f":"IF(OR(AND((AA53/AC53>$J$31),AA53/AC53<$K$31),AB53=0), \"Injured vs uninjured\", \"Injured vs benchmark\")","v":{"$error":"#DIV/0!"}},{"$f":"IF(AD53=\"Injured vs uninjured\", Z53/AA53,Z53/AC53)","v":{"$error":"#DIV/0!"}},{"$f":"M43","v":0.9},{"$f":"IF(AE53>=85%,\"Pass\",IF(AE53<85%,\"Fail\",\"Error\"))","v":{"$error":"#DIV/0!"}},{"$f":"AH51","v":"Injured"},"Uninjured","Benchmark",{"$f":"IF(OR(AND((AI54/AJ54>$J$31),AI54/AJ54<$K$31),AC53=0), \"Injured vs uninjured\", \"Injured vs benchmark\")","v":{"$error":"#DIV/0!"}},{"$f":"IF(AK53=\"Injured vs Uninjured\", AH54/AI54,AH54/AC53)","v":{"$error":"#DIV/0!"}},{"$f":"IF(AL53>=85%,\"Pass\",IF(AL53<85%,\"Fail\",\"Error\"))","v":{"$error":"#DIV/0!"}},null,"Progress 1",{"$f":"W43","v":0},{"$f":"X43","v":0},"DynoMo",{"$f":"AH44","v":{"$error":"#DIV/0!"}},{"$f":"AI44","v":{"$error":"#DIV/0!"}},{"$f":"AC43","v":0},{"$f":"IF(AU53>0,AU53,AT53)","v":{"$error":"#DIV/0!"}},{"$f":"IF(OR(AND((AT53/AV53>$J$31),AT53/AV53<$K$31),AU53=0), \"Injured vs uninjured\", \"Injured vs benchmark\")","v":{"$error":"#DIV/0!"}},{"$f":"IF(AW53=\"Injured vs Uninjured\", AS53/AT53,AS53/AV53)","v":{"$error":"#DIV/0!"}},{"$f":"AF43","v":1},{"$f":"IF(AX53>=85%,\"Pass\",IF(AX53<85%,\"Fail\",\"Error\"))","v":{"$error":"#DIV/0!"}},{"$f":"BA51","v":"Injured"},"Uninjured","Benchmark",{"$f":"IF(OR(AND((BB54/BC54>$J$31),BB54/BC54<$K$31),AV53=0), \"Injured vs uninjured\", \"Injured vs benchmark\")","v":{"$error":"#DIV/0!"}},{"$f":"IF(BD53=\"Injured vs Uninjured\", BA54/BB54,BA54/BC54)","v":{"$error":"#DIV/0!"}},{"$f":"IF(BE53>=85%,\"Pass\",IF(AX53<85%,\"Fail\",\"Error\"))","v":{"$error":"#DIV/0!"}}]
[null,null,null,null,null,"Joule",null,null,null,null,null,null,{"$f":"L53-M53","v":{"$error":"#REF!"}},null,null,null,null,null,null,null,null,null,null,null,"Joule",null,null,null,null,null,null,{"$f":"AE53-AF53","v":{"$error":"#DIV/0!"}},null,{"$f":"IF(AG53=\"pass\",Z53,\"Enter New Value\")","v":{"$error":"#DIV/0!"}},{"$f":"IF(AG53=\"pass\",AA53,\"Enter New Value\")","v":{"$error":"#DIV/0!"}},{"$f":"IF(X53=\"\",\"Ignore\",IF(AD53=\"Injured vs Uninjured\",AC53,AC53))","v":{"$error":"#DIV/0!"}},null,null,null,null,null,null,null,"Joule",null,null,null,null,null,null,{"$f":"AX53-AY53","v":{"$error":"#DIV/0!"}},null,{"$f":"IF(AZ53=\"Pass\",AS53,\"Enter New Value\")","v":{"$error":"#DIV/0!"}},{"$f":"IF(AZ53=\"Pass\",AT53,\"Enter New Value\")","v":{"$error":"#DIV/0!"}},{"$f":"IF(X39=\"Enter New Value\",\"Ignore\",IF(AW53=\"Injured vs Uninjured\",AT53,AV53))","v":{"$error":"#DIV/0!"}}]
[null,null,{"$f":"C53","v":"Initial Eval"},null,null,"MicroFit/Biofet",null,null,null,{"$f":"IF(I55>0,I55,H55)","v":0},{"$f":"#REF!","v":{"$error":"#REF!"}},{"$f":"#REF!","v":{"$error":"#REF!"}},0.95,null,"Injured",null,"Uninjured",null,{"$f":"#REF!","v":{"$error":"#REF!"}},null,null,{"$f":"V53","v":"Initial"},{"$f":"D45","v":0},{"$f":"E45","v":0},"Step",{"$f":"O46","v":{"$error":"#DIV/0!"}},{"$f":"P46","v":{"$error":"#DIV/0!"}},{"$f":"J45","v":0},{"$f":"IF(AB55>0,AB55,AA55)","v":{"$error":"#DIV/0!"}},{"$f":"IF(OR(AND((AA55/AC55>$J$31),AA55/AC55<$K$31),AB55=0), \"Injured vs uninjured\", \"Injured vs benchmark\")","v":{"$error":"#DIV/0!"}},{"$f":"IF(AD55=\"Injured vs uninjured\", Z55/AA55,Z55/AC55)","v":{"$error":"#DIV/0!"}},{"$f":"M45","v":1},{"$f":"IF(AE55>=85%,\"Pass\",IF(AE55<85%,\"Fail\",\"Error\"))","v":{"$error":"#DIV/0!"}},{"$f":"AH53","v":"Injured"},"Uninjured","Benchmark",{"$f":"IF(OR(AND((AI56/AJ56>$J$31),AI56/AJ56<$K$31),AC55=0), \"Injured vs uninjured\", \"Injured vs benchmark\")","v":{"$error":"#DIV/0!"}},{"$f":"IF(AK55=\"Injured vs Uninjured\", AH56/AI56,AH56/AC55)","v":{"$error":"#DIV/0!"}},{"$f":"IF(AL55>=85%,\"Pass\",IF(AL55<85%,\"Fail\",\"Error\"))","v":{"$error":"#DIV/0!"}},null,"Progress 1",{"$f":"W45","v":0},{"$f":"X45","v":0},"MicroFit/Biofet",{"$f":"AH46","v":{"$error":"#DIV/0!"}},{"$f":"AI46","v":{"$error":"#DIV/0!"}},{"$f":"AC45","v":0},{"$f":"IF(AU55>0,AU55,AT55)","v":{"$error":"#DIV/0!"}},{"$f":"IF(OR(AND((AT55/AV55>$J$31),AT55/AV55<$K$31),AU55=0), \"Injured vs uninjured\", \"Injured vs benchmark\")","v":{"$error":"#DIV/0!"}},{"$f":"IF(AW55=\"Injured vs Uninjured\", AS55/AT55,AS55/AV55)","v":{"$error":"#DIV/0!"}},{"$f":"AF45","v":1},{"$f":"IF(AX55>=85%,\"Pass\",IF(AX55<85%,\"Fail\",\"Error\"))","v":{"$error":"#DIV/0!"}},{"$f":"BA53","v":"Injured"},"Uninjured","Benchmark",{"$f":"IF(OR(AND((BB56/BC56>$J$31),BB56/BC56<$K$31),AV55=0), \"Injured vs uninjured\", \"Injured vs benchmark\")","v":{"$error":"#DIV/0!"}},{"$f":"IF(BD55=\"Injured vs Uninjured\", BA56/BB56,BA56/BC56)","v":{"$error":"#DIV/0!"}},{"$f":"IF(BE55>=85%,\"Pass\",IF(AX55<85%,\"Fail\",\"Error\"))","v":{"$error":"#DIV/0!"}}]
[null,null,null,null,null,"Joule",null,null,null,null,null,null,{"$f":"L55-M55","v":{"$error":"#REF!"}},null,null,null,null,null,null,null,null,null,null,null,"Numeric value",null,null,null,null,null,null,{"$f":"AE55-AF55","v":{"$error":"#DIV/0!"}},null,{"$f":"IF(AG55=\"pass\",Z55,\"Enter New Value\")","v":{"$error":"#DIV/0!"}},{"$f":"IF(AG55=\"pass\",AA55,\"Enter New Value\")","v":{"$error":"#DIV/0!"}},{"$f":"IF(X55=\"\",\"Ignore\",IF(AD55=\"Injured vs Uninjured\",AC55,AC55))","v":{"$error":"#DIV/0!"}},null,null,null,null,null,null,null,"Joule",null,null,null,null,null,null,{"$f":"AX55-AY55","v":{"$error":"#DIV/0!"}},null,{"$f":"IF(AZ55=\"Pass\",AS55,\"Enter New Value\")","v":{"$error":"#DIV/0!"}},{"$f":"IF(AZ55=\"Pass\",AT55,\"Enter New Value\")","v":{"$error":"#DIV/0!"}},{"$f":"IF(X39=\"Enter New Value\",\"Ignore\",IF(AW55=\"Injured vs Uninjured\",AT55,AV55))","v":{"$error":"#DIV/0!"}}]
[null,null,{"$f":"C55","v":"Initial Eval"},null,null,"MicroFit/Biofet",null,null,null,{"$f":"IF(I57>0,I57,H57)","v":0},{"$f":"#REF!","v":{"$error":"#REF!"}},{"$f":"#REF!","v":{"$error":"#REF!"}},0.95,null,"Injured",null,"Uninjured",null,{"$f":"#REF!","v":{"$error":"#REF!"}},null,null,{"$f":"V55","v":"Initial"},{"$f":"D47","v":0},{"$f":"E47","v":0},"MicroFit/Biofet",{"$f":"O48","v":{"$error":"#DIV/0!"}},{"$f":"P48","v":{"$error":"#DIV/0!"}},{"$f":"J47","v":0},{"$f":"IF(AB57>0,AB57,AA57)","v":{"$error":"#DIV/0!"}},{"$f":"IF(OR(AND((AA57/AC57>$J$31),AA57/AC57<$K$31),AB57=0), \"Injured vs uninjured\", \"Injured vs benchmark\")","v":{"$error":"#DIV/0!"}},{"$f":"IF(AD57=\"Injured vs uninjured\", Z57/AA57,Z57/AC57)","v":{"$error":"#DIV/0!"}},{"$f":"M47","v":1},{"$f":"IF(AE57>=85%,\"Pass\",IF(AE57<85%,\"Fail\",\"Error\"))","v":{"$error":"#DIV/0!"}},{"$f":"AH55","v":"Injured"},"Uninjured","Benchmark",{"$f":"IF(OR(AND((AI58/AJ58>$J$31),AI58/AJ58<$K$31),AC57=0), \"Injured vs uninjured\", \"Injured vs benchmark\")","v":{"$error":"#DIV/0!"}},{"$f":"IF(AK57=\"Injured vs Uninjured\", AH58/AI58,AH58/AC57)","v":{"$error":"#DIV/0!"}},{"$f":"IF(AL57>=85%,\"Pass\",IF(AL57<85%,\"Fail\",\"Error\"))","v":{"$error":"#DIV/0!"}},null,"Progress 1",{"$f":"W47","v":0},{"$f":"X47","v":0},"MicroFit/Biofet",{"$f":"AH48","v":{"$error":"#DIV/0!"}},{"$f":"AI48","v":{"$error":"#DIV/0!"}},{"$f":"AC47","v":0},{"$f":"IF(AU57>0,AU57,AT57)","v":{"$error":"#DIV/0!"}},{"$f":"IF(OR(AND((AT57/AV57>$J$31),AT57/AV57<$K$31),AU57=0), \"Injured vs uninjured\", \"Injured vs benchmark\")","v":{"$error":"#DIV/0!"}},{"$f":"IF(AW57=\"Injured vs Uninjured\", AS57/AT57,AS57/AV57)","v":{"$error":"#DIV/0!"}},{"$f":"AF47","v":1},{"$f":"IF(AX57>=85%,\"Pass\",IF(AX57<85%,\"Fail\",\"Error\"))","v":{"$error":"#DIV/0!"}},{"$f":"BA55","v":"Injured"},"Uninjured","Benchmark",{"$f":"IF(OR(AND((BB58/BC58>$J$31),BB58/BC58<$K$31),AV57=0), \"Injured vs uninjured\", \"Injured vs benchmark\")","v":{"$error":"#DIV/0!"}},{"$f":"IF(BD57=\"Injured vs Uninjured\", BA58/BB58,BA58/BC58)","v":{"$error":"#DIV/0!"}},{"$f":"IF(BE57>=85%,\"Pass\",IF(AX57<85%,\"Fail\",\"Error\"))","v":{"$error":"#DIV/0!"}}]
[null,null,null,null,null,"Joule",null,null,null,null,null,null,{"$f":"L57-M57","v":{"$error":"#REF!"}},null,null,null,null,null,null,null,null,null,null,null,"Kg",null,null,null,null,null,null,{"$f":"AE57-AF57","v":{"$error":"#DIV/0!"}},null,{"$f":"IF(AG57=\"pass\",Z57,\"Enter New Value\")","v":{"$error":"#DIV/0!"}},{"$f":"IF(AG57=\"pass\",AA57,\"Enter New Value\")","v":{"$error":"#DIV/0!"}},{"$f":"IF(X57=\"\",\"Ignore\",IF(AD57=\"Injured vs Uninjured\",AC57,AC57))","v":{"$error":"#DIV/0!"}},null,null,null,null,null,null,null,"Joule",null,null,null,null,null,null,{"$f":"AX57-AY57","v":{"$error":"#DIV/0!"}},null,{"$f":"IF(AZ57=\"Pass\",AS57,\"Enter New Value\")","v":{"$error":"#DIV/0!"}},{"$f":"IF(AZ57=\"Pass\",AT57,\"Enter New Value\")","v":{"$error":"#DIV/0!"}},{"$f":"IF(X39=\"Enter New Value\",\"Ignore\",IF(AW57=\"Injured vs Uninjured\",AT57,AV57))","v":{"$error":"#DIV/0!"}}]
[null,null,null,null,"j",null,null,null,null,null,null,null,null,null,null,null,null,null,null,null,null,null,null,null,null,null,null,null,null,null,null,null,null,null,null,null,null,null,null,null,"Initial",{"$f":"W49","v":0},{"$f":"X49","v":0},"Goniometre",{"$f":"AH50","v":{"$error":"#DIV/0!"}},{"$f":"AI50","v":{"$error":"#DIV/0!"}},{"$f":"AB49","v":0},{"$f":"IF(AU59>0,AU59,AT59)","v":{"$error":"#DIV/0!"}},{"$f":"IF(OR(AND((AT59/AV59>$J$31),AT59/AV59<$K$31),AU59=0), \"Injured vs uninjured\", \"Injured vs benchmark\")","v":{"$error":"#DIV/0!"}},{"$f":"IF(AW59=\"Injured vs Uninjured\", AS59/AT59,AS59/AV59)","v":{"$error":"#DIV/0!"}},{"$f":"M39","v":0.9},{"$f":"IF(AX59>=85%,\"Pass\",IF(AX59<85%,\"Fail\",\"Error\"))","v":{"$error":"#DIV/0!"}},{"$f":"BA57","v":"Injured"},"Uninjured","Benchmark",{"$f":"IF(OR(AND((BB60/BC60>$J$31),BB60/BC60<$K$31),AV59=0), \"Injured vs uninjured\", \"Injured vs benchmark\")","v":{"$error":"#DIV/0!"}},{"$f":"IF(BD59=\"Injured vs Uninjured\", BA60/BB60,BA60/BC60)","v":{"$error":"#DIV/0!"}},{"$f":"IF(BE59>=85%,\"Pass\",IF(AX59<85%,\"Fail\",\"Error\"))","v":{"$error":"#DIV/0!"}}]
[null,null,null,null,null,null,null,null,null,null,null,null,null,null,null,null,null,null,null,null,null,null,null,null,null,null,null,null,null,null,null,null,null,null,null,null,null,null,null,null,null,null,null,"Degrees",null,null,null,null,null,null,{"$f":"AX59-AY59","v":{"$error":"#DIV/0!"}},null,{"$f":"IF(AZ59=\"Pass\",AS59,\"Enter New Value\")","v":{"$error":"#DIV/0!"}},{"$f":"IF(AZ59=\"Pass\",AT59,\"Enter New Value\")","v":{"$error":"#DIV/0!"}},{"$f":"IF(X39=\"Enter New Value\",\"Ignore\",IF(AW59=\"Injured vs Uninjured\",AT59,AV59))","v":{"$error":"#DIV/0!"}}]
[null,null,null,null,null,null,null,null,null,null,null,null,null,null,null,null,null,null,null,null,null,null,null,null,null,null,null,null,null,null,null,null,null,null,null,null,null,null,null,null,{"$f":"AO59","v":"Initial"},{"$f":"W51","v":0},{"$f":"X51","v":0},"Goniometre",{"$f":"AH52","v":{"$error":"#DIV/0!"}},{"$f":"AI52","v":{"$error":"#DIV/0!"}},{"$f":"AB51","v":0},{"$f":"IF(AU61>0,AU61,AT61)","v":{"$error":"#DIV/0!"}},{"$f":"IF(OR(AND((AT61/AV61>$J$31),AT61/AV61<$K$31),AU61=0), \"Injured vs uninjured\", \"Injured vs benchmark\")","v":{"$error":"#DIV/0!"}},{"$error":"#DIV/0!"},{"$f":"M41","v":0.9},{"$f":"IF(AX61>=85%,\"Pass\",IF(AX61<85%,\"Fail\",\"Error\"))","v":{"$error":"#DIV/0!"}},{"$f":"BA59","v":"Injured"},"Uninjured","Benchmark",{"$f":"IF(OR(AND((BB62/BC62>$J$31),BB62/BC62<$K$31),AV61=0), \"Injured vs uninjured\", \"Injured vs benchmark\")","v":{"$error":"#DIV/0!"}},{"$f":"IF(BD61=\"Injured vs Uninjured\", BA62/BB62,BA62/BC62)","v":{"$error":"#DIV/0!"}},{"$f":"IF(BE61>=85%,\"Pass\",IF(AX61<85%,\"Fail\",\"Error\"))","v":{"$error":"#DIV/0!"}}]
[null,null,null,null,null,null,null,null,null,null,null,null,null,null,null,null,null,null,null,null,null,null,null,null,null,null,null,null,null,null,null,null,null,null,null,null,null,null,null,null,null,null,null,"Degrees",null,null,null,null,null,null,{"$f":"AX61-AY61","v":{"$error":"#DIV/0!"}},null,{"$f":"IF(AZ61=\"Pass\",AS61,\"Enter New Value\")","v":{"$error":"#DIV/0!"}},{"$f":"IF(AZ61=\"Pass\",AT61,\"Enter New Value\")","v":{"$error":"#DIV/0!"}},{"$f":"IF(X39=\"Enter New Value\",\"Ignore\",IF(AW61=\"Injured vs Uninjured\",AT61,AV61))","v":{"$error":"#DIV/0!"}}]
[null,null,null,null,null,null,null,null,null,null,null,null,null,null,null,null,null,null,null,null,null,null,null,null,null,null,null,null,null,null,null,null,null,null,null,null,null,null,null,null,{"$f":"AO61","v":"Initial"},{"$f":"W53","v":0},{"$f":"X53","v":0},"MicroFit/Biofet",{"$f":"AH54","v":{"$error":"#DIV/0!"}},{"$error":"#DIV/0!"},{"$f":"AB53","v":0},{"$f":"IF(AU63>0,AU63,AT63)","v":{"$error":"#DIV/0!"}},{"$f":"IF(OR(AND((AT63/AV63>$J$31),AT63/AV63<$K$31),AU63=0), \"Injured vs uninjured\", \"Injured vs benchmark\")","v":{"$error":"#DIV/0!"}},{"$f":"IF(AW63=\"Injured vs Uninjured\", AS63/AT63,AS63/AV63)","v":{"$error":"#DIV/0!"}},{"$f":"M43","v":0.9},{"$f":"IF(AX63>=85%,\"Pass\",IF(AX63<85%,\"Fail\",\"Error\"))","v":{"$error":"#DIV/0!"}},{"$f":"BA61","v":"Injured"},"Uninjured","Benchmark",{"$f":"IF(OR(AND((BB64/BC64>$J$31),BB64/BC64<$K$31),AV63=0), \"Injured vs uninjured\", \"Injured vs benchmark\")","v":{"$error":"#DIV/0!"}},{"$f":"IF(BD63=\"Injured vs Uninjured\", BA64/BB64,BA64/BC64)","v":{"$error":"#DIV/0!"}},{"$f":"IF(BE63>=85%,\"Pass\",IF(AX63<85%,\"Fail\",\"Error\"))","v":{"$error":"#DIV/0!"}}]
[null,null,null,null,null,null,null,null,null,null,null,null,null,null,null,null,null,null,null,null,null,null,null,null,null,null,null,null,null,null,null,null,null,null,null,null,null,null,null,null,null,null,null,"Joule",null,null,null,null,null,null,{"$f":"AX63-AY63","v":{"$error":"#DIV/0!"}},null,{"$f":"IF(AZ63=\"Pass\",AS63,\"Enter New Value\")","v":{"$error":"#DIV/0!"}},{"$f":"IF(AZ63=\"Pass\",AT63,\"Enter New Value\")","v":{"$error":"#DIV/0!"}},{"$f":"IF(X39=\"Enter New Value\",\"Ignore\",IF(AW63=\"Injured vs Uninjured\",AT63,AV63))","v":{"$error":"#DIV/0!"}}]
[null,null,null,null,null,null,null,null,null,null,null,null,null,null,null,null,null,null,null,null,null,null,null,null,null,null,null,null,null,null,null,null,null,null,null,null,null,null,null,null,{"$f":"AO63","v":"Initial"},{"$f":"W55","v":0},{"$f":"X55","v":0},"Step",{"$f":"AH56","v":{"$error":"#DIV/0!"}},{"$error":"#DIV/0!"},{"$f":"AB55","v":0},{"$f":"IF(AU65>0,AU65,AT65)","v":{"$error":"#DIV/0!"}},{"$f":"IF(OR(AND((AT65/AV65>$J$31),AT65/AV65<$K$31),AU65=0), \"Injured vs uninjured\", \"Injured vs benchmark\")","v":{"$error":"#DIV/0!"}},{"$error":"#DIV/0!"},{"$f":"M45","v":1},{"$f":"IF(AX65>=85%,\"Pass\",IF(AX65<85%,\"Fail\",\"Error\"))","v":{"$error":"#DIV/0!"}},{"$f":"BA63","v":"Injured"},"Uninjured","Benchmark",{"$f":"IF(OR(AND((BB66/BC66>$J$31),BB66/BC66<$K$31),AV65=0), \"Injured vs uninjured\", \"Injured vs benchmark\")","v":{"$error":"#DIV/0!"}},{"$f":"IF(BD65=\"Injured vs Uninjured\", BA66/BB66,BA66/BC66)","v":{"$error":"#DIV/0!"}},{"$f":"IF(BE65>=85%,\"Pass\",IF(AX65<85%,\"Fail\",\"Error\"))","v":{"$error":"#DIV/0!"}}]
[null,null,null,null,null,null,null,null,null,null,null,null,null,null,null,null,null,null,null,null,null,null,null,null,null,null,null,null,null,null,null,null,null,null,null,null,null,null,null,null,null,null,null,"Numeric value",null,null,null,null,null,null,{"$f":"AX65-AY65","v":{"$error":"#DIV/0!"}},null,{"$f":"IF(AZ65=\"pass\",AS65,\"Enter New Value\")","v":{"$error":"#DIV/0!"}},{"$f":"IF(AZ65=\"pass\",AT65,\"Enter New Value\")","v":{"$error":"#DIV/0!"}},{"$f":"IF(X39=\"Enter New Value\",\"Ignore\",IF(AW65=\"Injured vs Uninjured\",AT65,AV65))","v":{"$error":"#DIV/0!"}}]
[null,null,null,null,null,null,null,null,null,null,null,null,null,null,null,null,null,null,null,null,null,null,null,null,null,null,null,null,null,null,null,null,null,null,null,null,null,null,null,null,{"$f":"AO65","v":"Initial"},{"$f":"W57","v":0},{"$f":"X57","v":0},"MicroFit/Biofet",{"$f":"AH58","v":{"$error":"#DIV/0!"}},{"$error":"#DIV/0!"},{"$f":"AB57","v":0},{"$f":"IF(AU67>0,AU67,AT67)","v":{"$error":"#DIV/0!"}},{"$f":"IF(OR(AND((AT67/AV67>$J$31),AT67/AV67<$K$31),AU67=0), \"Injured vs uninjured\", \"Injured vs benchmark\")","v":{"$error":"#DIV/0!"}},{"$error":"#DIV/0!"},{"$f":"M47","v":1},{"$f":"IF(AX67>=85%,\"Pass\",IF(AX67<85%,\"Fail\",\"Error\"))","v":{"$error":"#DIV/0!"}},{"$f":"BA65","v":"Injured"},"Uninjured","Benchmark",{"$f":"IF(OR(AND((BB68/BC68>$J$31),BB68/BC68<$K$31),AV67=0), \"Injured vs uninjured\", \"Injured vs benchmark\")","v":{"$error":"#DIV/0!"}},{"$f":"IF(BD67=\"Injured vs Uninjured\", BA68/BB68,BA68/BC68)","v":{"$error":"#DIV/0!"}},{"$f":"IF(BE67>=85%,\"Pass\",IF(AX67<85%,\"Fail\",\"Error\"))","v":{"$error":"#DIV/0!"}}]
[null,null,null,null,null,null,null,null,null,null,null,null,null,null,null,null,null,null,null,null,null,null,null,null,null,null,null,null,null,null,null,null,null,null,null,null,null,null,null,null,null,null,null,"Kg",null,null,null,null,null,null,{"$f":"AX67-AY67","v":{"$error":"#DIV/0!"}},null,{"$f":"IF(AZ67=\"Pass\",AS67,\"Enter New Value\")","v":{"$error":"#DIV/0!"}},{"$f":"IF(AZ67=\"Pass\",AT67,\"Enter New Value\")","v":{"$error":"#DIV/0!"}},{"$f":"IF(X39=\"Enter New Value\",\"Ignore\",IF(AW67=\"Injured vs Uninjured\",AT67,AV67))","v":{"$error":"#DIV/0!"}}]
[]
[]
[]
["Patient reported outcomes measure initial assessment",null,null,null,null,null,"Patient reported outcomes measure: Post treatment 1",null,null,null,null,null,null,null,"Patient reported outcomes measure: Post treatment 2"]
[null,null,null,null,null,null,null,null,null,null,null,null,null,null,null,null,null,null,null,null,null,null,"Patient reported outcomes measure: Discharge"]
["Assessment","Questioniare","Current Score","Benchmark","Comments",null,"Assessment","Questioniare","Prevouis Score","Current Score","Progress","Benchmark","Comments",null,"Assessment","Questioniare","Prevouis Score","Current Score","Progress","Benchmark"]
[{"$f":"$A$19","v":"Initial Eval"},{"$f":"B18","v":"MTSS"},{"$f":"C18","v":0},0,{"$f":"$E$18","v":"Graph 1 represents the subjective results(…%) of ….......An estamted benchmark(..) were selected based on his end goals."},null,"Post Intervention 1",{"$f":"AA18","v":"MTSS"},{"$f":"C75","v":0},{"$f":"Q18","v":0.67},{"$f":"Table15[[#This Row],[Current Score]]-Table15[[#This Row],[Prevouis Score]]","v":0.67},{"$f":"D75","v":0},{"$f":"$AE$18","v":"Graph 1 summarizes the subjective improvement of(….%) over the exercise rehabilitation period. Currently, Mr. Potgieter achieved 66% (Benchmark 89%)"},null,"Post intervention 2",{"$f":"H75","v":"MTSS"},{"$f":"J75","v":0.67},{"$f":"AB18","v":0.87},{"$f":"R75-Q75","v":0.19999999999999996},{"$f":"L75","v":0},null,null,"Assessment","Questioniare","Prevouis Score","Current Score","Progress","Benchmark"]
[{"$f":"$A$19","v":"Initial Eval"},"IKDC",0,0,{"$f":"$E$19","v":"Graph 2 represents the subjective results(…%) of ….......An estamted benchmark(..) were selected based on his end goals."},null,"Post Intervention 1",{"$f":"AA19","v":"IKDC"},{"$f":"C76","v":0},{"$f":"Q19","v":0.6},{"$f":"Table15[[#This Row],[Current Score]]-Table15[[#This Row],[Prevouis Score]]","v":0.6},{"$f":"D76","v":0},"Graph 2 summarizes the subjective improvement(….%) over the exercise rehabilitation period. Currently, Mr. Potgieter achieved 66% (Benchmark 89%)",null,"Post intervention 2",{"$f":"H76","v":"IKDC"},{"$f":"J76","v":0.6},{"$f":"AB19","v":0.88},{"$f":"R76-Q76","v":0.28000000000000003},{"$f":"L76","v":0},null,null,"Discharge",{"$f":"P75","v":"MTSS"},{"$f":"R75","v":0.87},{"$f":"AR17","v":0},{"$f":"Z76-Y76","v":-0.87},0]
["Initial Eval","Hagos",0,0,{"$f":"$E$20","v":"Graph 3 represents the subjective results(…%) of ….......An estamted benchmark(..) were selected based on his end goals."},null,"Post Intervention 1",{"$f":"AA20","v":"Hagos"},{"$f":"C77","v":0},0.76,{"$f":"Table15[[#This Row],[Current Score]]-Table15[[#This Row],[Prevouis Score]]","v":0.76},{"$f":"D77","v":0},"Graph 3 summarizes the subjective improvement(….%) over the exercise rehabilitation period. Currently, Mr. Potgieter achieved 66% (Benchmark 89%)",null,"Post intervention 2",{"$f":"H77","v":"Hagos"},{"$f":"J77","v":0.76},0.8,4.0000000000000036E-2,{"$f":"L77","v":0},null,null,"Discharge","IKDC",{"$f":"R76","v":0.88},{"$f":"AR18","v":0},{"$f":"Z77-Y77","v":-0.88},0]
[null,null,null,null,null,null,null,null,null,null,null,null,null,null,null,null,null,null,null,null,null,null,"Discharge","Hagos",0.8,0,-0.8,0]
[]
[]
[]
[]
[]
[]
[]
[]
[]
[]
[]
[]
[]
[]
[]
[]
[]
[]
[]
[]
["Patient reported outcomes measure initial assessment",null,null,null,null,null,null,null,null,null,null,null,null,null,"Patient reported outcomes measure: Post Treatment 2",null,null,null,null,null,null,null,"Patient reported outcomes measure: Post Treatment Discharge"]
[null,null,null,null,null,null,"Patient reported outcomes measure: Post Treatment 1"]
["Assessment","Activity","Location","Involve before intervention",null,null,null,null,null,null,null,null,null,null,"Assessment","Activity","Loation","Initial VAS pain","Current VAS pain",null,null,null,"Assessment","Activity","Loation","Initial VAS pain","Current VAS pain"]
[{"$f":"A24","v":"Initial"},"Running @ 10 min",{"$f":"C24","v":"Patellar tendon"},{"$f":"E24","v":0},null,null,"Assessment","Acitivity","Location","Initial VAS pain","Current VAS pain",null,null,null,"Post intervention 2","Running @ 10 min","Patella tendon",{"$f":"AD24","v":3},{"$f":"AS23","v":3},null,null,null,"Discharge","Running @ 10 min","Patella tendon",{"$f":"AS23","v":3},{"$f":"AU23","v":1}]
["Initial","One leg squad","Patellar tendon",0,null,null,"Progress 1",{"$f":"AA24","v":"Running @ 10 min"},{"$f":"C24","v":"Patellar tendon"},{"$f":"D102","v":0},{"$f":"AF24","v":1},null,null,null,"Post intervention 2","One leg squad","Medial frmoral",{"$f":"AD25","v":2},{"$f":"AS24","v":2},null,null,null,"Discharge","One leg squad","Medial frmoral",{"$f":"AS24","v":2},{"$f":"AU24","v":1}]
[null,null,null,null,null,null,"Progress 1",{"$f":"AA25","v":"One leg squad"},{"$f":"C25","v":"Patellar tendon"},{"$f":"D103","v":0},{"$f":"AF25","v":1}]
[]
[]
[]
[]
[]
[]
[]
[]
[]
[]
[]
[]
[]
[]
[]
[]
[]
["Performance based outcomes:  Initial assessment",null,null,null,null,null,"Performance based outcomes:  Post Treatment 1 Results",null,null,null,null,null,null,"Performance based outcomes:  Post Treatment 2 Results",null,null,null,null,null,null,"Performance based outcomes:  Discharge"]
[]
["Assessment","Performance Based Outcomes","Comparisons","Difference","Target","Performance deficit","Progress Ass","Performance Based Outcomes","Comparison","Difference","Target","Performance Deficit","Progress","Discharge","Performance Based Outcomes","Comparison","Diff after Interv","Target","Performance Deficit","Progress","Discharge","Performance Based Outcomes","Comparison","Diff after Interv","Target","Performance Deficit","Progress"]
[{"$f":"C39","v":"Initial Eval"},{"$f":"D39","v":0},{"$f":"K39","v":{"$error":"#DIV/0!"}},{"$f":"L39","v":{"$error":"#DIV/0!"}},{"$f":"M39","v":0.9},{"$f":"D125-E125","v":{"$error":"#DIV/0!"}},{"$f":"A125","v":"Initial Eval"},0,{"$f":"R39","v":{"$error":"#DIV/0!"}},{"$f":"S39","v":{"$error":"#DIV/0!"}},{"$f":"E125","v":0.9},{"$f":"'Input Sheet'!$J125-'Input Sheet'!$K125","v":{"$error":"#DIV/0!"}},{"$f":"J125-D125","v":{"$error":"#DIV/0!"}},{"$f":"G125","v":"Initial Eval"},{"$f":"H125","v":0},{"$f":"I125","v":{"$error":"#DIV/0!"}},{"$f":"AL49","v":{"$error":"#DIV/0!"}},{"$f":"K125","v":0.9},{"$f":"Q125-R125","v":{"$error":"#DIV/0!"}},{"$f":"Q125-J125","v":{"$error":"#DIV/0!"}},{"$f":"N125","v":"Initial Eval"},0,{"$f":"BD59","v":{"$error":"#DIV/0!"}},{"$f":"BE59","v":{"$error":"#DIV/0!"}},{"$f":"R125","v":0.9},{"$f":"X125-Y125","v":{"$error":"#DIV/0!"}},{"$f":"X125-Q125","v":{"$error":"#DIV/0!"}}]
[{"$f":"C41","v":"Initial Eval"},{"$f":"D41","v":0},{"$f":"K41","v":{"$error":"#DIV/0!"}},{"$f":"L41","v":{"$error":"#DIV/0!"}},{"$f":"M41","v":0.9},{"$f":"D126-E126","v":{"$error":"#DIV/0!"}},"Initial Eval",0,{"$f":"R41","v":{"$error":"#DIV/0!"}},{"$f":"S41","v":{"$error":"#DIV/0!"}},{"$f":"E126","v":0.9},{"$f":"'Input Sheet'!$J126-'Input Sheet'!$K126","v":{"$error":"#DIV/0!"}},{"$f":"J126-D126","v":{"$error":"#DIV/0!"}},{"$f":"G126","v":"Initial Eval"},{"$f":"H126","v":0},{"$f":"AK51","v":{"$error":"#DIV/0!"}},{"$f":"AL51","v":{"$error":"#DIV/0!"}},{"$f":"K126","v":0.9},{"$f":"Q126-R126","v":{"$error":"#DIV/0!"}},{"$error":"#DIV/0!"},"Initial Eval",0,{"$f":"BD61","v":{"$error":"#DIV/0!"}},{"$f":"BE61","v":{"$error":"#DIV/0!"}},0.9,{"$f":"X126-Y126","v":{"$error":"#DIV/0!"}},{"$error":"#DIV/0!"}]
[{"$f":"C43","v":"Initial Eval"},{"$f":"D43","v":0},{"$f":"K43","v":{"$error":"#DIV/0!"}},{"$f":"L43","v":{"$error":"#DIV/0!"}},{"$f":"M43","v":0.9},{"$error":"#DIV/0!"},"Initial Eval",0,{"$f":"R43","v":{"$error":"#DIV/0!"}},{"$f":"S43","v":{"$error":"#DIV/0!"}},{"$f":"E127","v":0.9},{"$f":"'Input Sheet'!$J127-'Input Sheet'!$K127","v":{"$error":"#DIV/0!"}},{"$f":"J127-D127","v":{"$error":"#DIV/0!"}},"Initial Eval",0,{"$f":"AK53","v":{"$error":"#DIV/0!"}},{"$f":"AL53","v":{"$error":"#DIV/0!"}},{"$f":"K127","v":0.9},{"$error":"#DIV/0!"},{"$error":"#DIV/0!"},"Initial Eval",0,{"$f":"BD63","v":{"$error":"#DIV/0!"}},{"$f":"BE63","v":{"$error":"#DIV/0!"}},0.9,{"$error":"#DIV/0!"},{"$error":"#DIV/0!"}]
[{"$f":"C45","v":"Initial Eval"},{"$f":"D45","v":0},{"$f":"K45","v":{"$error":"#DIV/0!"}},{"$f":"L45","v":{"$error":"#DIV/0!"}},{"$f":"M45","v":1},{"$error":"#DIV/0!"},"Initial Eval",0,{"$f":"R45","v":{"$error":"#DIV/0!"}},{"$f":"S45","v":{"$error":"#DIV/0!"}},{"$f":"E128","v":1},{"$f":"'Input Sheet'!$J128-'Input Sheet'!$K128","v":{"$error":"#DIV/0!"}},{"$f":"J128-D128","v":{"$error":"#DIV/0!"}},"Initial Eval",0,{"$f":"AK55","v":{"$error":"#DIV/0!"}},{"$f":"AL55","v":{"$error":"#DIV/0!"}},{"$f":"K128","v":1},{"$error":"#DIV/0!"},{"$error":"#DIV/0!"},"Initial Eval",0,{"$f":"BD65","v":{"$error":"#DIV/0!"}},{"$f":"BE65","v":{"$error":"#DIV/0!"}},1,{"$error":"#DIV/0!"},{"$error":"#DIV/0!"}]
[{"$f":"C47","v":"Initial Eval"},{"$f":"D47","v":0},{"$f":"K47","v":{"$error":"#DIV/0!"}},{"$f":"L47","v":{"$error":"#DIV/0!"}},{"$f":"M47","v":1},{"$error":"#DIV/0!"},"Initial Eval",0,{"$f":"R47","v":{"$error":"#DIV/0!"}},{"$f":"S47","v":{"$error":"#DIV/0!"}},{"$f":"E129","v":1},{"$f":"'Input Sheet'!$J129-'Input Sheet'!$K129","v":{"$error":"#DIV/0!"}},{"$f":"J129-D129","v":{"$error":"#DIV/0!"}},"Initial Eval",0,{"$f":"AK57","v":{"$error":"#DIV/0!"}},{"$f":"AL57","v":{"$error":"#DIV/0!"}},{"$f":"K129","v":1},{"$error":"#DIV/0!"},{"$error":"#DIV/0!"},"Initial Eval",0,{"$f":"BD67","v":{"$error":"#DIV/0!"}},{"$f":"BE67","v":{"$error":"#DIV/0!"}},1,{"$error":"#DIV/0!"},{"$error":"#DIV/0!"}]
[null,null,null,null,null,null,{"$f":"V39","v":"Progress 1  "},{"$f":"W39","v":0},{"$f":"AD39","v":{"$error":"#DIV/0!"}},{"$f":"AE39","v":{"$error":"#DIV/0!"}},{"$f":"AF39","v":1},{"$f":"'Input Sheet'!$J130-'Input Sheet'!$K130","v":{"$error":"#DIV/0!"}},0,"Progress 1  ",0,{"$f":"AK39","v":{"$error":"#DIV/0!"}},{"$f":"AL39","v":{"$error":"#DIV/0!"}},{"$f":"AF39","v":1},{"$error":"#DIV/0!"},{"$error":"#DIV/0!"},{"$f":"AO49","v":"Progress 1"},{"$f":"AP49","v":0},{"$f":"BD49","v":{"$error":"#DIV/0!"}},{"$f":"BE49","v":{"$error":"#DIV/0!"}},1,{"$error":"#DIV/0!"},{"$error":"#DIV/0!"}]
[null,null,null,null,null,null,{"$f":"V41","v":"Progress 1  "},{"$f":"W41","v":0},{"$f":"AD41","v":{"$error":"#DIV/0!"}},{"$f":"AE41","v":{"$error":"#DIV/0!"}},{"$f":"AF41","v":1},{"$f":"'Input Sheet'!$J131-'Input Sheet'!$K131","v":{"$error":"#DIV/0!"}},0,"Progress 1  ",0,{"$f":"AK41","v":{"$error":"#DIV/0!"}},{"$f":"AL41","v":{"$error":"#DIV/0!"}},{"$f":"AF41","v":1},{"$error":"#DIV/0!"},{"$error":"#DIV/0!"},{"$f":"AO51","v":"Progress 1"},{"$f":"AP51","v":0},{"$f":"BD51","v":{"$error":"#DIV/0!"}},{"$f":"BE51","v":{"$error":"#DIV/0!"}},1,{"$error":"#DIV/0!"},{"$error":"#DIV/0!"}]
[null,null,null,null,null,null,{"$f":"V43","v":"Progress 1  "},{"$f":"W43","v":0},{"$f":"AD43","v":{"$error":"#DIV/0!"}},{"$f":"AE43","v":{"$error":"#DIV/0!"}},{"$f":"AF43","v":1},{"$f":"'Input Sheet'!$J132-'Input Sheet'!$K132","v":{"$error":"#DIV/0!"}},0,"Progress 1  ",0,{"$f":"AK43","v":{"$error":"#DIV/0!"}},{"$f":"AL43","v":{"$error":"#DIV/0!"}},{"$f":"AF43","v":1},{"$error":"#DIV/0!"},{"$error":"#DIV/0!"},{"$f":"AO53","v":"Progress 1"},{"$f":"AP53","v":0},{"$f":"BD53","v":{"$error":"#DIV/0!"}},{"$f":"BE53","v":{"$error":"#DIV/0!"}},1,{"$error":"#DIV/0!"},{"$error":"#DIV/0!"}]
[null,null,null,null,null,null,{"$f":"V45","v":"Progress 1  "},{"$f":"W45","v":0},{"$f":"AD45","v":{"$error":"#DIV/0!"}},{"$f":"AE45","v":{"$error":"#DIV/0!"}},{"$f":"AF45","v":1},{"$f":"'Input Sheet'!$J133-'Input Sheet'!$K133","v":{"$error":"#DIV/0!"}},0,"Progress 1  ",0,{"$f":"AK45","v":{"$error":"#DIV/0!"}},{"$f":"AL45","v":{"$error":"#DIV/0!"}},{"$f":"AF45","v":1},{"$error":"#DIV/0!"},{"$error":"#DIV/0!"},{"$f":"AO55","v":"Progress 1"},{"$f":"AP55","v":0},{"$f":"BD55","v":{"$error":"#DIV/0!"}},{"$f":"BE55","v":{"$error":"#DIV/0!"}},1,{"$error":"#DIV/0!"},{"$error":"#DIV/0!"}]
[null,null,null,null,null,null,{"$f":"V47","v":"Progress 1  "},{"$f":"W47","v":0},{"$f":"AD47","v":{"$error":"#DIV/0!"}},{"$f":"AE47","v":{"$error":"#DIV/0!"}},{"$f":"AF47","v":1},{"$f":"'Input Sheet'!$J134-'Input Sheet'!$K134","v":{"$error":"#DIV/0!"}},0,"Progress 1  ",0,{"$f":"AK47","v":{"$error":"#DIV/0!"}},{"$f":"AL47","v":{"$error":"#DIV/0!"}},{"$f":"AF47","v":1},{"$error":"#DIV/0!"},{"$error":"#DIV/0!"},{"$f":"AO57","v":"Progress 1"},{"$f":"AP57","v":0},{"$f":"BD57","v":{"$error":"#DIV/0!"}},{"$f":"BE57","v":{"$error":"#DIV/0!"}},1,{"$error":"#DIV/0!"},{"$error":"#DIV/0!"}]
[null,null,null,null,null,null,null,null,null,null,null,null,null,{"$f":"AO39","v":"Discharge"},{"$f":"AP39","v":0},{"$f":"AW39","v":{"$error":"#DIV/0!"}},{"$f":"AX39","v":{"$error":"#DIV/0!"}},{"$f":"AY39","v":1},{"$error":"#DIV/0!"},0,{"$f":"N135","v":"Discharge"},0,{"$f":"BD39","v":{"$error":"#DIV/0!"}},{"$f":"BE39","v":{"$error":"#DIV/0!"}},1,{"$error":"#DIV/0!"},{"$error":"#DIV/0!"}]
[null,null,null,null,null,null,null,null,null,null,null,null,null,{"$f":"AO41","v":"Discharge"},{"$f":"AP41","v":0},{"$f":"AW41","v":{"$error":"#DIV/0!"}},{"$f":"AX41","v":{"$error":"#DIV/0!"}},{"$f":"AY41","v":0.95},{"$error":"#DIV/0!"},0,"Discharge",0,{"$f":"BD41","v":{"$error":"#DIV/0!"}},{"$f":"BE41","v":{"$error":"#DIV/0!"}},0.95,{"$error":"#DIV/0!"},{"$error":"#DIV/0!"}]
[null,null,null,null,null,null,null,null,null,null,null,null,null,{"$f":"AO43","v":"Discharge"},{"$f":"AP43","v":0},{"$f":"AW43","v":{"$error":"#DIV/0!"}},{"$f":"AX43","v":{"$error":"#DIV/0!"}},{"$f":"AY43","v":0.95},{"$error":"#DIV/0!"},0,"Discharge",0,{"$f":"BD43","v":{"$error":"#DIV/0!"}},{"$f":"BE43","v":{"$error":"#DIV/0!"}},0.95,{"$error":"#DIV/0!"},{"$error":"#DIV/0!"}]
[null,null,null,null,null,null,null,null,null,null,null,null,null,{"$f":"AO45","v":"Discharge"},{"$f":"AP45","v":0},{"$f":"AW45","v":{"$error":"#DIV/0!"}},{"$f":"AX45","v":{"$error":"#DIV/0!"}},{"$f":"AY45","v":0.95},{"$error":"#DIV/0!"},0,"Discharge",0,{"$f":"BD45","v":{"$error":"#DIV/0!"}},{"$f":"BE45","v":{"$error":"#DIV/0!"}},0.95,{"$error":"#DIV/0!"},{"$error":"#DIV/0!"}]
[null,null,null,null,null,null,null,null,null,null,null,null,null,{"$f":"AO47","v":"Discharge"},{"$f":"AP47","v":0},{"$f":"AW47","v":{"$error":"#DIV/0!"}},{"$f":"AX47","v":{"$error":"#DIV/0!"}},{"$f":"AY47","v":0.95},{"$error":"#DIV/0!"},0,"Discharge",0,{"$f":"BD47","v":{"$error":"#DIV/0!"}},{"$f":"BE47","v":{"$error":"#DIV/0!"}},0.95,{"$error":"#DIV/0!"},{"$error":"#DIV/0!"}]
[]
[]
[]
[]
[]
[]
[]
[]
[]
[]
[]
[]
[]
[]
[]
[]
[]
[]
[]
[]
[]
[]
[]
[]
[]
[]
[]
[]
[]
[]
[]
[]
["Assessment","Performance Based Outcomes","Column1","Injured","Uninjured ","Injured(After)","Uninjured (After)","Improvement(Injured)","Improvement(Uninjured)",null,"Assessment","Performance Based Outcomes","Re-Assessment","Injured","Uninjured ","Injured(After)","Uninjured (After)","Improvement(Injured)","Improvement(Uninjured)",null,"Assessment","Performance Based Outcomes","Re-Assessment","Injured","Uninjured ","Injured(After)","Uninjured (After)","Improvement(Injured)","Improvement(Uninjured)"]
[{"$f":"A125","v":"Initial Eval"},0,"Post treatment T1",{"$f":"G39","v":0},{"$f":"H39","v":0},{"$f":"O40","v":{"$error":"#DIV/0!"}},{"$f":"P40","v":{"$error":"#DIV/0!"}},{"$f":"(F173-D173)/F173","v":{"$error":"#DIV/0!"}},{"$f":"(G173-E173)/G173","v":{"$error":"#DIV/0!"}},null,"Progress 1",{"$f":"W39","v":0},"Post treatment 2",{"$f":"Z39","v":0},{"$f":"AA39","v":0},{"$f":"AH40","v":{"$error":"#DIV/0!"}},{"$f":"AI40","v":{"$error":"#DIV/0!"}},{"$f":"(P173-N173)/P173","v":{"$error":"#DIV/0!"}},{"$f":"(Q173-O173)/Q173","v":{"$error":"#DIV/0!"}},null,"Discharge",{"$f":"AP39","v":0},"Post treatment 3",{"$f":"AS39","v":0},{"$f":"AT39","v":0},{"$f":"BA40","v":{"$error":"#DIV/0!"}},{"$f":"BB40","v":{"$error":"#DIV/0!"}},{"$f":"(Z173-X173)/Z173","v":{"$error":"#DIV/0!"}},{"$f":"(AA173-Y173)/AA173","v":{"$error":"#DIV/0!"}}]
["Initial Eval",0,"Post treatment T1",{"$f":"G41","v":0},{"$f":"H41","v":0},{"$f":"O42","v":{"$error":"#DIV/0!"}},{"$f":"P42","v":{"$error":"#DIV/0!"}},{"$error":"#DIV/0!"},{"$error":"#DIV/0!"},null,"Progress 1",{"$f":"W41","v":0},"Post treatment 2",{"$f":"Z41","v":0},{"$f":"AA41","v":0},{"$f":"AH42","v":{"$error":"#DIV/0!"}},{"$f":"AI42","v":{"$error":"#DIV/0!"}},{"$f":"(P174-N174)/P174","v":{"$error":"#DIV/0!"}},{"$f":"(Q174-O174)/Q174","v":{"$error":"#DIV/0!"}},null,"Discharge",{"$f":"AP41","v":0},"Post treatment 3",{"$f":"AS41","v":0},{"$f":"AT41","v":0},{"$f":"BA42","v":{"$error":"#DIV/0!"}},{"$f":"BB42","v":{"$error":"#DIV/0!"}},{"$f":"(Z174-X174)/Z174","v":{"$error":"#DIV/0!"}},{"$f":"(AA174-Y174)/AA174","v":{"$error":"#DIV/0!"}}]
["Initial Eval",0,"Post treatment T1",{"$f":"G43","v":0},{"$f":"H43","v":0},{"$f":"O44","v":{"$error":"#DIV/0!"}},{"$f":"P44","v":{"$error":"#DIV/0!"}},{"$error":"#DIV/0!"},{"$error":"#DIV/0!"},null,"Progress 1",{"$f":"W43","v":0},"Post treatment 2",{"$f":"Z43","v":0},{"$f":"AA43","v":0},{"$f":"AH44","v":{"$error":"#DIV/0!"}},{"$f":"AI44","v":{"$error":"#DIV/0!"}},{"$error":"#DIV/0!"},{"$error":"#DIV/0!"},null,"Discharge",{"$f":"AP43","v":0},"Post treatment 3",{"$f":"AS43","v":0},{"$f":"AT43","v":0},{"$f":"BA44","v":{"$error":"#DIV/0!"}},{"$f":"BB44","v":{"$error":"#DIV/0!"}},{"$error":"#DIV/0!"},{"$error":"#DIV/0!"}]
["Initial Eval",0,"Post treatment T1",{"$f":"G45","v":0},{"$f":"H45","v":0},{"$f":"O46","v":{"$error":"#DIV/0!"}},{"$f":"P46","v":{"$error":"#DIV/0!"}},{"$error":"#DIV/0!"},{"$error":"#DIV/0!"},null,"Progress 1",{"$f":"W45","v":0},"Post treatment 2",{"$f":"Z45","v":0},{"$f":"AA45","v":0},{"$f":"AH46","v":{"$error":"#DIV/0!"}},{"$f":"AI46","v":{"$error":"#DIV/0!"}},{"$error":"#DIV/0!"},{"$error":"#DIV/0!"},null,"Discharge",{"$f":"AP45","v":0},"Post treatment 3",{"$f":"AS45","v":0},{"$f":"AT45","v":0},{"$f":"BA46","v":{"$error":"#DIV/0!"}},{"$f":"BB46","v":{"$error":"#DIV/0!"}},{"$error":"#DIV/0!"},{"$error":"#DIV/0!"}]
["Initial Eval",0,"Post treatment T1",{"$f":"G47","v":0},{"$f":"H47","v":0},{"$f":"O48","v":{"$error":"#DIV/0!"}},{"$f":"P48","v":{"$error":"#DIV/0!"}},{"$error":"#DIV/0!"},{"$error":"#DIV/0!"},null,"Progress 1",{"$f":"W47","v":0},"Post treatment 2",{"$f":"Z47","v":0},{"$f":"AA47","v":0},{"$f":"AH48","v":{"$error":"#DIV/0!"}},{"$f":"AI48","v":{"$error":"#DIV/0!"}},{"$error":"#DIV/0!"},{"$error":"#DIV/0!"},null,"Discharge",{"$f":"AP47","v":0},"Post treatment 3",{"$f":"AS47","v":0},{"$f":"AT47","v":0},{"$f":"BA48","v":{"$error":"#DIV/0!"}},{"$f":"BB48","v":{"$error":"#DIV/0!"}},{"$error":"#DIV/0!"},{"$error":"#DIV/0!"}]
["Progress 1",{"$f":"B173","v":0},"Post treatment T2",{"$f":"F173","v":{"$error":"#DIV/0!"}},{"$f":"G173","v":{"$error":"#DIV/0!"}},{"$f":"AH50","v":{"$error":"#DIV/0!"}},{"$f":"AI50","v":{"$error":"#DIV/0!"}},{"$error":"#DIV/0!"},{"$error":"#DIV/0!"},null,"Discharge",{"$f":"L173","v":0},"Post treatment 3",{"$f":"P173","v":{"$error":"#DIV/0!"}},{"$error":"#DIV/0!"},{"$f":"BA50","v":{"$error":"#DIV/0!"}},{"$f":"BB50","v":{"$error":"#DIV/0!"}},{"$error":"#DIV/0!"},{"$error":"#DIV/0!"}]
["Progress 1",{"$f":"B174","v":0},"Post treatment T2",{"$error":"#DIV/0!"},{"$error":"#DIV/0!"},{"$f":"AH52","v":{"$error":"#DIV/0!"}},{"$f":"AI52","v":{"$error":"#DIV/0!"}},{"$error":"#DIV/0!"},{"$error":"#DIV/0!"},null,"Discharge",0,"Post treatment 3",{"$error":"#DIV/0!"},{"$error":"#DIV/0!"},{"$f":"BA52","v":{"$error":"#DIV/0!"}},{"$f":"BB52","v":{"$error":"#DIV/0!"}},{"$error":"#DIV/0!"},{"$error":"#DIV/0!"}]
["Progress 1",{"$f":"B175","v":0},"Post treatment T2",{"$error":"#DIV/0!"},{"$error":"#DIV/0!"},{"$f":"AH54","v":{"$error":"#DIV/0!"}},{"$f":"AI54","v":{"$error":"#DIV/0!"}},{"$error":"#DIV/0!"},{"$error":"#DIV/0!"},null,"Discharge",0,"Post treatment 3",{"$error":"#DIV/0!"},{"$error":"#DIV/0!"},{"$f":"BA54","v":{"$error":"#DIV/0!"}},{"$f":"BB54","v":{"$error":"#DIV/0!"}},{"$error":"#DIV/0!"},{"$error":"#DIV/0!"}]
["Progress 1",{"$f":"B176","v":0},"Post treatment T2",{"$error":"#DIV/0!"},{"$error":"#DIV/0!"},{"$f":"AH56","v":{"$error":"#DIV/0!"}},{"$f":"AI56","v":{"$error":"#DIV/0!"}},{"$error":"#DIV/0!"},{"$error":"#DIV/0!"},null,"Discharge",0,"Post treatment 3",{"$error":"#DIV/0!"},{"$error":"#DIV/0!"},{"$f":"BA56","v":{"$error":"#DIV/0!"}},{"$f":"BB56","v":{"$error":"#DIV/0!"}},{"$error":"#DIV/0!"},{"$error":"#DIV/0!"}]
["Progress 1",{"$f":"B177","v":0},"Post treatment T2",{"$error":"#DIV/0!"},{"$error":"#DIV/0!"},{"$f":"AH58","v":{"$error":"#DIV/0!"}},{"$f":"AI58","v":{"$error":"#DIV/0!"}},{"$error":"#DIV/0!"},{"$error":"#DIV/0!"},null,"Discharge",0,"Post treatment 3",{"$error":"#DIV/0!"},{"$error":"#DIV/0!"},{"$f":"BA68","v":{"$error":"#DIV/0!"}},{"$f":"BB68","v":{"$error":"#DIV/0!"}},{"$error":"#DIV/0!"},{"$error":"#DIV/0!"}]
["Discharge",{"$f":"B173","v":0},"Post treatment  T3",{"$error":"#DIV/0!"},{"$error":"#DIV/0!"},{"$f":"BA60","v":{"$error":"#DIV/0!"}},{"$f":"BB60","v":{"$error":"#DIV/0!"}},{"$error":"#DIV/0!"},{"$error":"#DIV/0!"}]
["Discharge",{"$f":"B174","v":0},"Post treatment  T3",{"$error":"#DIV/0!"},{"$error":"#DIV/0!"},{"$f":"BA62","v":{"$error":"#DIV/0!"}},{"$f":"BB62","v":{"$error":"#DIV/0!"}},{"$error":"#DIV/0!"},{"$error":"#DIV/0!"}]
["Discharge",{"$f":"B175","v":0},"Post treatment  T3",{"$error":"#DIV/0!"},{"$error":"#DIV/0!"},{"$f":"BA64","v":{"$error":"#DIV/0!"}},{"$f":"BB64","v":{"$error":"#DIV/0!"}},{"$error":"#DIV/0!"},{"$error":"#DIV/0!"}]
["Discharge",{"$f":"B176","v":0},"Post treatment  T3",{"$error":"#DIV/0!"},{"$error":"#DIV/0!"},{"$f":"BA66","v":{"$error":"#DIV/0!"}},{"$f":"BB66","v":{"$error":"#DIV/0!"}},{"$error":"#DIV/0!"},{"$error":"#DIV/0!"}]
["Discharge",{"$f":"B177","v":0},"Post treatment  T3",{"$error":"#DIV/0!"},{"$error":"#DIV/0!"},{"$f":"BA68","v":{"$error":"#DIV/0!"}},{"$f":"BB68","v":{"$error":"#DIV/0!"}},{"$error":"#DIV/0!"},{"$error":"#DIV/0!"}]

{"sheet":"Input Bilateral","index":3,"n_rows":132,"n_cols":52,"rows_kept":132,"cut":false,"hidden":true,"merged":[[48,50,49,50],[50,50,51,50],[52,50,53,50],[31,46,31,47],[32,50,33,50],[34,50,35,50],[36,50,37,50],[38,50,39,50],[40,50,41,50],[48,49,49,49],[40,49,41,49],[38,49,39,49],[34,49,35,49],[106,26,107,26],[106,27,107,27],[106,29,107,29],[106,30,107,30],[86,30,87,30],[90,30,91,30],[94,30,95,30],[98,30,99,30],[102,30,103,30],[100,30,101,30],[98,26,99,26],[98,27,99,27],[98,29,99,29],[94,26,95,26],[94,27,95,27],[94,29,95,29],[90,26,91,26],[90,27,91,27],[102,26,103,26],[102,27,103,27],[102,29,103,29],[106,12,107,12],[106,22,107,22],[106,23,107,23],[106,25,107,25],[104,30,105,30],[106,4,107,4],[106,5,107,5],[106,6,107,6],[106,7,107,7],[106,8,107,8],[106,9,107,9],[106,10,107,10],[106,11,107,11],[104,25,105,25],[104,26,105,26],[104,27,105,27],[104,29,105,29],[104,9,105,9],[104,10,105,10],[104,11,105,11],[104,12,105,12],[104,22,105,22],[104,23,105,23],[104,4,105,4],[104,5,105,5],[104,6,105,6],[104,7,105,7],[104,8,105,8],[102,12,103,12],[102,22,103,22],[102,23,103,23],[102,25,103,25],[102,4,103,4],[102,5,103,5],[102,6,103,6],[102,7,103,7],[102,8,103,8],[102,9,103,9],[102,10,103,10],[98,12,99,12],[98,22,99,22],[98,23,99,23],[102,11,103,11],[100,9,101,9],[100,10,101,10],[100,11,101,11],[100,12,101,12],[100,22,101,22],[100,23,101,23],[98,9,99,9],[98,10,99,10],[98,11,99,11],[96,5,97,5],[96,6,97,6],[96,7,97,7],[96,8,97,8],[100,4,101,4],[100,5,101,5],[100,6,101,6],[100,7,101,7],[100,8,101,8],[98,4,99,4],[98,5,99,5],[98,6,99,6],[98,7,99,7],[98,8,99,8],[94,12,95,12],[94,22,95,22],[94,23,95,23],[98,25,99,25],[96,30,97,30],[96,26,97,26],[96,27,97,27],[96,29,97,29],[94,4,95,4],[94,5,95,5],[94,6,95,6],[94,7,95,7],[94,8,95,8],[94,9,95,9],[94,10,95,10],[94,11,95,11],[96,25,97,25],[96,9,97,9],[96,10,97,10],[96,11,97,11],[96,12,97,12],[96,22,97,22],[96,23,97,23],[96,4,97,4],[92,25,93,25],[92,9,93,9],[92,10,93,10],[92,11,93,11],[92,12,93,12],[92,22,93,22],[92,23,93,23],[92,4,93,4],[92,5,93,5],[92,6,93,6],[92,7,93,7],[92,8,93,8],[90,12,91,12],[90,22,91,22],[90,23,91,23],[90,25,91,25],[90,4,91,4],[90,5,91,5],[90,6,91,6],[90,7,91,7],[90,8,91,8],[90,9,91,9],[90,10,91,10],[90,11,91,11],[86,12,87,12],[86,22,87,23],[88,30,89,30],[88,25,89,25],[88,26,89,26],[88,27,89,27],[88,29,89,29],[88,9,89,9],[88,10,89,10],[88,11,89,11],[88,12,89,12],[88,22,89,22],[88,23,89,23],[82,20,104,21],[90,29,91,29],[94,25,95,25],[92,30,93,30],[92,26,93,26],[92,27,93,27],[92,29,93,29],[100,25,101,25],[100,26,101,26],[100,27,101,27],[100,29,101,29],[66,36,67,36],[66,37,67,37],[66,38,67,38],[66,40,67,40],[66,41,67,41],[66,42,67,42],[66,43,67,43],[85,2,107,3],[85,4,85,13],[85,22,85,32],[86,4,87,5],[86,6,87,6],[86,7,87,7],[86,8,87,8],[86,25,87,25],[86,27,87,27],[86,29,87,29],[88,4,89,4],[88,5,89,5],[88,6,89,6],[88,7,89,7],[88,8,89,8],[86,10,87,10],[86,11,87,11],[62,36,63,36],[62,37,63,37],[62,38,63,38],[62,40,63,40],[62,41,63,41],[62,42,63,42],[62,43,63,43],[64,36,65,36],[64,37,65,37],[64,38,65,38],[64,40,65,40],[64,41,65,41],[64,42,65,42],[64,43,65,43],[58,36,59,36],[58,37,59,37],[58,38,59,38],[58,40,59,40],[58,41,59,41],[58,51,59,51],[60,36,61,36],[60,37,61,37],[60,38,61,38],[60,40,61,40],[60,41,61,41],[60,42,61,42],[60,43,61,43],[58,42,59,42],[58,43,59,43],[58,45,59,45],[58,48,59,48],[58,49,59,49],[60,45,61,45],[60,48,61,48],[60,49,61,49],[60,51,61,51],[58,50,59,50],[60,50,61,50],[54,36,55,36],[54,37,55,37],[54,38,55,38],[54,40,55,40],[54,41,55,41],[54,51,55,51],[56,36,57,36],[56,37,57,37],[56,38,57,38],[56,40,57,40],[56,41,57,41],[56,42,57,42],[56,43,57,43],[54,42,55,42],[54,43,55,43],[54,45,55,45],[54,48,55,48],[54,49,55,49],[56,45,57,45],[56,48,57,48],[56,49,57,49],[56,51,57,51],[54,50,55,50],[56,50,57,50],[50,51,51,51],[52,36,53,36],[52,37,53,37],[52,38,53,38],[52,40,53,40],[52,41,53,41],[52,42,53,42],[52,43,53,43],[50,42,51,42],[50,43,51,43],[50,45,51,45],[50,48,51,48],[50,49,51,49],[50,36,51,36],[50,37,51,37],[50,38,51,38],[50,40,51,40],[50,41,51,41],[52,45,53,45],[52,48,53,48],[52,49,53,49],[52,51,53,51],[50,9,51,9],[50,15,51,15],[50,19,51,19],[48,43,49,43],[48,45,49,45],[48,48,49,48],[48,9,49,9],[48,15,49,15],[48,19,49,19],[48,20,49,20],[48,21,49,21],[50,25,51,25],[50,26,51,26],[50,28,51,28],[50,31,51,31],[50,32,51,32],[50,34,51,34],[50,33,51,33],[50,20,51,20],[50,21,51,21],[50,23,51,23],[50,24,51,24],[48,51,49,51],[50,2,51,2],[50,3,51,3],[50,4,51,4],[50,6,51,6],[48,38,49,38],[48,40,49,40],[48,41,49,41],[48,42,49,42],[48,28,49,28],[48,31,49,31],[48,32,49,32],[48,34,49,34],[48,36,49,36],[48,37,49,37],[48,33,49,33],[48,23,49,23],[48,24,49,24],[48,25,49,25],[48,26,49,26],[48,8,49,8],[50,7,51,7],[50,8,51,8],[48,2,49,2],[48,3,49,3],[48,4,49,4],[48,6,49,6],[48,7,49,7],[46,41,47,41],[46,42,47,42],[46,32,47,32],[46,34,47,34],[46,36,47,36],[46,37,47,37],[46,38,47,38],[46,40,47,40],[46,33,47,33],[46,24,47,24],[46,25,47,25],[46,26,47,26],[46,28,47,28],[46,31,47,31],[46,15,47,15],[46,19,47,19],[44,51,45,51],[44,42,45,42],[44,43,45,43],[44,45,45,45],[44,48,45,48],[44,49,45,49],[44,24,45,24],[46,48,47,48],[46,49,47,49],[46,51,47,51],[46,43,47,43],[46,45,47,45],[44,50,45,50],[46,50,47,50],[46,2,47,2],[46,3,47,3],[46,4,47,4],[46,6,47,6],[46,7,47,7],[46,8,47,8],[46,9,47,9],[44,36,45,36],[44,37,45,37],[44,25,45,25],[44,26,45,26],[44,28,45,28],[44,31,45,31],[44,32,45,32],[44,34,45,34],[44,33,45,33],[44,20,45,20],[44,21,45,21],[44,23,45,23],[46,20,47,20],[46,21,47,21],[46,23,47,23],[44,19,45,19],[44,2,45,2],[42,43,43,43],[42,45,43,45],[42,48,43,48],[42,9,43,9],[42,15,43,15],[42,19,43,19],[42,20,43,20],[42,21,43,21],[44,38,45,38],[44,40,45,40],[44,41,45,41],[44,3,45,3],[44,4,45,4],[44,6,45,6],[42,38,43,38],[42,40,43,40],[42,41,43,41],[42,42,43,42],[42,28,43,28],[42,31,43,31],[42,32,43,32],[42,34,43,34],[42,36,43,36],[42,37,43,37],[42,33,43,33],[42,23,43,23],[42,24,43,24],[42,25,43,25],[42,26,43,26],[42,8,43,8],[44,7,45,7],[44,8,45,8],[44,9,45,9],[44,15,45,15],[40,51,41,51],[42,2,43,2],[42,3,43,3],[42,4,43,4],[42,6,43,6],[42,7,43,7],[40,41,41,41],[40,42,41,42],[40,43,41,43],[40,45,41,45],[40,32,41,32],[40,34,41,34],[40,36,41,36],[40,37,41,37],[40,38,41,38],[40,40,41,40],[40,33,41,33],[40,24,41,24],[40,25,41,25],[42,49,43,49],[42,51,43,51],[42,50,43,50],[40,20,41,20],[40,21,41,21],[40,23,41,23],[40,8,41,8],[40,9,41,9],[40,11,41,11],[40,14,41,14],[40,15,41,15],[40,48,41,48],[40,2,41,2],[40,3,41,3],[40,4,41,4],[40,6,41,6],[40,7,41,7],[40,26,41,26],[40,28,41,28],[40,31,41,31],[40,17,41,17],[40,19,41,19],[38,20,39,20],[38,16,39,16],[38,37,39,37],[38,38,39,38],[38,40,39,40],[38,41,39,41],[38,42,39,42],[38,26,39,26],[38,28,39,28],[38,31,39,31],[38,32,39,32],[38,34,39,34],[38,2,39,2],[38,3,39,3],[38,4,39,4],[38,6,39,6],[38,7,39,7],[38,8,39,8],[38,9,39,9],[36,42,37,42],[36,43,37,43],[36,36,37,36],[36,37,37,37],[36,38,37,38],[36,40,37,40],[36,41,37,41],[36,25,37,25],[36,26,37,26],[36,28,37,28],[36,31,37,31],[38,43,39,43],[38,21,39,21],[38,23,39,23],[38,24,39,24],[38,25,39,25],[38,11,39,11],[38,51,39,51],[36,20,37,20],[36,21,37,21],[36,23,37,23],[36,24,37,24],[36,9,37,9],[36,11,37,11],[36,14,37,14],[36,15,37,15],[36,17,37,17],[36,19,37,19],[36,16,37,16],[38,36,39,36],[38,33,39,33],[36,51,37,51],[36,45,37,45],[36,48,37,48],[36,49,37,49],[38,45,39,45],[38,48,39,48],[38,14,39,14],[38,15,39,15],[38,17,39,17],[38,19,39,19],[34,51,35,51],[34,42,35,42],[34,43,35,43],[34,45,35,45],[34,48,35,48],[36,2,37,2],[36,3,37,3],[36,4,37,4],[36,6,37,6],[36,7,37,7],[36,8,37,8],[34,41,35,41],[34,34,35,34],[34,36,35,36],[34,37,35,37],[34,38,35,38],[34,40,35,40],[34,25,35,25],[34,26,35,26],[34,28,35,28],[36,32,37,32],[36,34,37,34],[36,33,37,33],[34,32,35,32],[34,19,35,19],[34,20,35,20],[34,21,35,21],[34,23,35,23],[34,24,35,24],[34,9,35,9],[34,11,35,11],[34,14,35,14],[34,15,35,15],[34,17,35,17],[34,16,35,16],[32,15,33,15],[32,48,33,48],[32,49,33,49],[32,51,33,51],[34,2,35,2],[34,3,35,3],[34,4,35,4],[34,6,35,6],[34,7,35,7],[34,8,35,8],[32,41,33,41],[32,42,33,42],[32,43,33,43],[32,45,33,45],[32,32,33,32],[32,34,33,34],[32,36,33,36],[32,37,33,37],[32,38,33,38],[32,40,33,40],[32,33,33,33],[32,24,33,24],[32,25,33,25],[34,31,35,31],[30,42,31,42],[30,43,31,43],[32,2,33,2],[32,3,33,3],[32,4,33,4],[32,6,33,6],[32,7,33,7],[30,36,31,37],[30,38,31,38],[30,40,31,40],[30,41,31,41],[30,24,31,24],[30,25,31,25],[30,26,31,26],[30,28,31,28],[30,8,31,8],[30,9,31,9],[30,19,31,20],[30,21,31,21],[30,23,31,23],[31,12,31,13],[32,26,33,26],[32,8,33,8],[32,9,33,9],[21,0,22,10],[25,0,26,18],[25,19,26,35],[31,29,31,30],[32,16,33,16],[40,16,41,16],[34,33,35,33],[29,0,53,1],[29,2,29,10],[29,18,51,18],[29,35,51,35],[30,2,31,3],[30,4,31,4],[30,6,31,6],[30,7,31,7],[32,28,33,28],[32,31,33,31],[32,17,33,17],[32,19,33,19],[32,20,33,20],[32,21,33,21],[32,23,33,23],[32,11,33,11],[32,14,33,14]]}
[]
[]
[]
[]
[]
[]
[]
[]
[]
[]
[]
[]
[]
[]
[]
[]
[]
[]
[]
[]
[]
["Start at INITIAL for FIRST ASSESSMENT"]
[null,null,null,null,null,null,null,null,null,null,null,0.8]
[]
[null,null,null,null,null,"Factor",0.85,null,1]
["Move to Progress 1 if not first assessment ----> --------------------->---------------------->-------------",null,null,null,null,null,null,null,null,null,null,null,null,null,null,null,null,null,null,"Move to progress 2 if progression made for final evaluation ---->-------------->------------->"]
[]
[]
[]
["INITIAL",null,"Performance Based Outcomes Measures (PBOM)-Unilateral",null,null,null,null,null,null,null,null,null,null,null,null,null,null,null,"Progress 1",null,null,null,null,null,null,null,null,null,null,null,null,null,null,null,null,"Progress 2"]
[null,null,"Musculoskeletal outcomes",null,"Test descriptor","Equipment","Current value","Bench mark","Comparisons","Difference","Target",null,null,null,null,null,null,null,null,"Musculoskeletal outcomes",null,"Test descriptor","Equipment","Current Value","Bench mark","Comparisons","Difference","Target","TEST 2 RESULTS",null,null,null,null,null,null,null,"Musculoskeletal outcomes",null,"Test descriptor","Equipment","Current vaue","Bench mark","Comparisons","Difference","Target"]
[null,null,null,null,null,"Metric",null,null,null,null," Performance Deficit","Test 1 Results ","Post treatment test",null,"Comparison","Difference","Progress","Test 2 Results ",null,null,null,null,"Metric",null,null,null,null," Performance Deficit",null,"Post treatment test",null,"Comparison","Differance","Progression","Test results",null,null,null,null,"Metric",null,null,null,null," Performance Deficit","Test 3 Results","Post treatment test",null,"Comparisons","Difference","Progress","Test results"]
[null,null,"Initial","dd","tt","Goniometre",123,150,"Current value vs benchmark",{"$f":"G33/H33","v":0.82},0.9,{"$f":"IF(J33>=85%,\"Pass\",IF(J33<85%,\"Fail\",\"Error\"))","v":"Fail"},"Current Value","Benchmark",{"$f":"I33","v":"Current value vs benchmark"},{"$f":"M34/N34","v":0.96},{"$f":"M34/G33-1","v":0.1707317073170731},{"$f":"IF(P33>=85%,\"Pass\",IF(P33<85%,\"Fail\",\"Error\"))","v":"Pass"},null,"Progress 1  ","ww","ww","Biodex",450,800,"Current value vs benchmark",{"$f":"X33/Y33","v":0.5625},1,{"$f":"IF(AA33>=85%,\"Pass\",IF(AA33<85%,\"Fail\",\"Error\"))","v":"Fail"},"Current value","Benchmark",{"$f":"Z33","v":"Current value vs benchmark"},{"$f":"AD34/AE34","v":0.75},{"$f":"AD34/X33-1","v":0.33333333333333326},{"$f":"IF(AG33>=85%,\"Pass\",IF(AG33<85%,\"Fail\",\"Error\"))","v":"Fail"},null,"Progress 2",null,null,"Stopwatch",null,null,"Current value vs benchmark",{"$f":"AO33/AP33","v":{"$error":"#DIV/0!"}},1,{"$f":"IF(AR33>=85%,\"Pass\",IF(AR33<85%,\"Fail\",\"Error\"))","v":{"$error":"#DIV/0!"}},"Current Value","Benchmark",{"$f":"AF33","v":"Current value vs benchmark"},{"$f":"AU34/AV34","v":{"$error":"#DIV/0!"}},{"$f":"AO33/AU34-1","v":{"$error":"#DIV/0!"}},{"$f":"IF(AX33>=85%,\"Pass\",IF(AX33<85%,\"Fail\",\"Error\"))","v":{"$error":"#DIV/0!"}}]
[null,null,null,null,null,"Degrees",null,null,null,null,{"$f":"J33-K33","v":-8.0000000000000071E-2},null,144,{"$f":"IF(D33=\"\",\"Ignore\",H33)","v":150},null,null,null,null,null,null,null,null,"Nm",null,null,null,null,{"$f":"AA33-AB33","v":-0.4375},null,600,{"$f":"IF(U33=\"\",\"Ignore\",Y33)","v":800},null,null,null,null,null,null,null,null,"Seconds",null,null,null,null,{"$f":"AR33-AS33","v":{"$error":"#DIV/0!"}},null,{"$f":"IF(AT39=\"Pass\",AO39,\"Enter New Value\")","v":{"$error":"#DIV/0!"}},{"$f":"IF(AM33=\"\",\"Ignore\",Y33)","v":"Ignore"}]
[null,null,"Initial","fgd","xcvc","Goniometre",150,200,"Current value vs benchmark",{"$f":"G35/H35","v":0.75},0.9,{"$f":"IF(J35>=85%,\"Pass\",IF(J35<85%,\"Fail\",\"Error\"))","v":"Fail"},{"$f":"M33","v":"Current Value"},{"$f":"N33","v":"Benchmark"},{"$f":"I35","v":"Current value vs benchmark"},{"$f":"M36/N36","v":0.94499999999999995},{"$f":"M36/G35-1","v":0.26},{"$f":"IF(P35>=85%,\"Pass\",IF(P35<85%,\"Fail\",\"Error\"))","v":"Pass"},null,{"$f":"T33","v":"Progress 1  "},"fhd","dg","Biodex",67,100,"Current value vs benchmark",{"$f":"X35/Y35","v":0.67},1,{"$f":"IF(AA35>=85%,\"Pass\",IF(AA35<85%,\"Fail\",\"Error\"))","v":"Fail"},"Current value",{"$f":"AE33","v":"Benchmark"},{"$f":"Z35","v":"Current value vs benchmark"},{"$f":"AD36/AE36","v":0.87},{"$f":"AD36/X35-1","v":0.29850746268656714},{"$f":"IF(AG35>=85%,\"Pass\",IF(AG35<85%,\"Fail\",\"Error\"))","v":"Pass"},null,"Progress 2",null,null,"Stopwatch",null,null,"Current value vs benchmark",{"$f":"AO35/AP35","v":{"$error":"#DIV/0!"}},0.95,{"$f":"IF(AR35>=85%,\"Pass\",IF(AR35<85%,\"Fail\",\"Error\"))","v":{"$error":"#DIV/0!"}},{"$f":"AU33","v":"Current Value"},{"$f":"AV33","v":"Benchmark"},{"$f":"AW33","v":"Current value vs benchmark"},{"$f":"AU36/AV36","v":{"$error":"#DIV/0!"}},{"$f":"AO35/AU36-1","v":{"$error":"#DIV/0!"}},{"$f":"IF(AX35>=85%,\"Pass\",IF(AX35<85%,\"Fail\",\"Error\"))","v":{"$error":"#DIV/0!"}}]
[null,null,null,null,null,"Degrees",null,null,null,null,{"$f":"J35-K35","v":-0.15000000000000002},null,189,{"$f":"IF(D35=\"\",\"Ignore\",H35)","v":200},null,null,null,null,null,null,null,null,"Kg",null,null,null,null,{"$f":"AA35-AB35","v":-0.32999999999999996},null,87,{"$f":"IF(U35=\"\",\"Ignore\",Y35)","v":100},null,null,null,null,null,null,null,null,"Joule",null,null,null,null,{"$f":"AR35-AS35","v":{"$error":"#DIV/0!"}},null,{"$f":"IF(AT35=\"Pass\",AO35,\"Enter New Value\")","v":{"$error":"#DIV/0!"}},{"$f":"IF(AM33=\"\",\"Ignore\",Y33)","v":"Ignore"}]
[null,null,"Initial",null,null,"MicroFit/Biofet",null,null,"Current value vs benchmark",{"$f":"G37/H37","v":{"$error":"#DIV/0!"}},0.9,{"$f":"IF(J37>=85%,\"Pass\",IF(J37<85%,\"Fail\",\"Error\"))","v":{"$error":"#DIV/0!"}},{"$f":"M35","v":"Current Value"},{"$f":"N35","v":"Benchmark"},{"$f":"I37","v":"Current value vs benchmark"},{"$f":"M38/N38","v":{"$error":"#DIV/0!"}},{"$f":"M38/G37-1","v":{"$error":"#DIV/0!"}},{"$f":"IF(P37>=85%,\"Pass\",IF(P37<85%,\"Fail\",\"Error\"))","v":{"$error":"#DIV/0!"}},null,{"$f":"T35","v":"Progress 1  "},null,null,"DynoMo",null,null,"Current value vs benchmark",{"$f":"X37/Y37","v":{"$error":"#DIV/0!"}},1,{"$f":"IF(AA37>=85%,\"Pass\",IF(AA37<85%,\"Fail\",\"Error\"))","v":{"$error":"#DIV/0!"}},"Current value",{"$f":"AE35","v":"Benchmark"},{"$f":"Z37","v":"Current value vs benchmark"},{"$f":"AD38/AE38","v":{"$error":"#DIV/0!"}},{"$f":"AD38/X37-1","v":{"$error":"#DIV/0!"}},{"$f":"IF(AG37>=85%,\"Pass\",IF(AG37<85%,\"Fail\",\"Error\"))","v":{"$error":"#DIV/0!"}},null,"Progress 2",null,null,"MicroFit/Biofet",null,null,"Current value vs benchmark",{"$f":"AO37/AP37","v":{"$error":"#DIV/0!"}},0.95,{"$f":"IF(AR37>=85%,\"Pass\",IF(AR37<85%,\"Fail\",\"Error\"))","v":{"$error":"#DIV/0!"}},{"$f":"AU35","v":"Current Value"},"Benchmark","Current value vs benchmark",{"$f":"AU38/AV38","v":{"$error":"#DIV/0!"}},{"$f":"AO37/AU38-1","v":{"$error":"#DIV/0!"}},{"$f":"IF(AX37>=85%,\"Pass\",IF(AX37<85%,\"Fail\",\"Error\"))","v":{"$error":"#DIV/0!"}}]
[null,null,null,null,null,"Joule",null,null,null,null,{"$f":"J37-K37","v":{"$error":"#DIV/0!"}},null,{"$f":"IF(L37=\"Pass\",G37,\"Enter New Value\")","v":{"$error":"#DIV/0!"}},{"$f":"IF(D37=\"\",\"Ignore\",H37)","v":"Ignore"},null,null,null,null,null,null,null,null,"Joule",null,null,null,null,{"$f":"AA37-AB37","v":{"$error":"#DIV/0!"}},null,{"$f":"IF(AC37=\"Pass\",X37,\"Enter New Value\")","v":{"$error":"#DIV/0!"}},{"$f":"IF(U37=\"\",\"Ignore\",Y37)","v":"Ignore"},null,null,null,null,null,null,null,null,"Joule",null,null,null,null,{"$f":"AR37-AS37","v":{"$error":"#DIV/0!"}},null,{"$f":"IF(AT37=\"Pass\",AO37,\"Enter New Value\")","v":{"$error":"#DIV/0!"}},{"$f":"IF(AM33=\"\",\"Ignore\",Y33)","v":"Ignore"}]
[null,null,"Initial",null,null,"Step",null,null,"Current value vs benchmark",{"$f":"G39/H39","v":{"$error":"#DIV/0!"}},1,{"$f":"IF(J39>=85%,\"Pass\",IF(J39<85%,\"Fail\",\"Error\"))","v":{"$error":"#DIV/0!"}},{"$f":"M37","v":"Current Value"},"Benchmark",{"$f":"I39","v":"Current value vs benchmark"},{"$f":"M40/N40","v":{"$error":"#DIV/0!"}},{"$f":"M40/G39-1","v":{"$error":"#DIV/0!"}},{"$f":"IF(P39>=85%,\"Pass\",IF(P39<85%,\"Fail\",\"Error\"))","v":{"$error":"#DIV/0!"}},null,{"$f":"T37","v":"Progress 1  "},null,null,"MicroFit/Biofet",null,null,"Current value vs benchmark",{"$f":"X39/Y39","v":{"$error":"#DIV/0!"}},1,{"$f":"IF(AA39>=85%,\"Pass\",IF(AA39<85%,\"Fail\",\"Error\"))","v":{"$error":"#DIV/0!"}},"Current value",{"$f":"AE37","v":"Benchmark"},{"$f":"Z39","v":"Current value vs benchmark"},{"$f":"AD40/AE40","v":{"$error":"#DIV/0!"}},{"$f":"AD40/X39-1","v":{"$error":"#DIV/0!"}},{"$f":"IF(AG39>=85%,\"Pass\",IF(AG39<85%,\"Fail\",\"Error\"))","v":{"$error":"#DIV/0!"}},null,"Progress 2",null,null,"MicroFit/Biofet",null,null,"Current value vs benchmark",{"$f":"AO39/AP39","v":{"$error":"#DIV/0!"}},0.95,{"$f":"IF(AR39>=85%,\"Pass\",IF(AR39<85%,\"Fail\",\"Error\"))","v":{"$error":"#DIV/0!"}},{"$f":"AU37","v":"Current Value"},"Benchmark","Current value vs benchmark",{"$f":"AU40/AV40","v":{"$error":"#DIV/0!"}},{"$f":"AO39/AU40-1","v":{"$error":"#DIV/0!"}},{"$f":"IF(AX39>=85%,\"Pass\",IF(AX39<85%,\"Fail\",\"Error\"))","v":{"$error":"#DIV/0!"}}]
[null,null,null,null,null,"Numeric value",null,null,null,null,{"$f":"J39-K39","v":{"$error":"#DIV/0!"}},null,{"$f":"IF(L39=\"Pass\",G39,\"Enter New Value\")","v":{"$error":"#DIV/0!"}},{"$f":"IF(D39=\"\",\"Ignore\",H39)","v":"Ignore"},null,null,null,null,null,null,null,null,"Joule",null,null,null,null,{"$f":"AA39-AB39","v":{"$error":"#DIV/0!"}},null,{"$f":"IF(AC39=\"Pass\",X39,\"Enter New Value\")","v":{"$error":"#DIV/0!"}},{"$f":"IF(U39=\"\",\"Ignore\",Y39)","v":"Ignore"},null,null,null,null,null,null,null,null,"Joule",null,null,null,null,{"$f":"AR39-AS39","v":{"$error":"#DIV/0!"}},null,{"$f":"IF(AT41=\"Pass\",AO41,\"Enter New Value\")","v":{"$error":"#DIV/0!"}},{"$f":"IF(AM33=\"\",\"Ignore\",Y33)","v":"Ignore"}]
[null,null,"Initial",null,null,"MicroFit/Biofet",null,null,"Current value vs benchmark",{"$f":"G41/H41","v":{"$error":"#DIV/0!"}},1,{"$f":"IF(J41>=85%,\"Pass\",IF(J41<85%,\"Fail\",\"Error\"))","v":{"$error":"#DIV/0!"}},{"$f":"M39","v":"Current Value"},"Benchmark",{"$f":"I41","v":"Current value vs benchmark"},{"$f":"M42/N42","v":{"$error":"#DIV/0!"}},{"$f":"M42/G41-1","v":{"$error":"#DIV/0!"}},{"$f":"IF(P41>=85%,\"Pass\",IF(P41<85%,\"Fail\",\"Error\"))","v":{"$error":"#DIV/0!"}},null,{"$f":"T39","v":"Progress 1  "},null,null,"MicroFit/Biofet",null,null,"Current value vs benchmark",{"$f":"X41/Y41","v":{"$error":"#DIV/0!"}},1,{"$f":"IF(AA41>=85%,\"Pass\",IF(AA41<85%,\"Fail\",\"Error\"))","v":{"$error":"#DIV/0!"}},"Current value",{"$f":"AE39","v":"Benchmark"},6,{"$f":"AD42/AE42","v":{"$error":"#DIV/0!"}},{"$f":"AD42/X41-1","v":{"$error":"#DIV/0!"}},{"$f":"IF(AG41>=85%,\"Pass\",IF(AG41<85%,\"Fail\",\"Error\"))","v":{"$error":"#DIV/0!"}},null,"Progress 2",null,null,"MicroFit/Biofet",null,null,"Current value vs benchmark",{"$f":"AO41/AP41","v":{"$error":"#DIV/0!"}},0.95,{"$f":"IF(AR41>=85%,\"Pass\",IF(AR41<85%,\"Fail\",\"Error\"))","v":{"$error":"#DIV/0!"}},{"$f":"AU39","v":"Current Value"},"Benchmark","Current value vs benchmark",{"$f":"AU42/AV42","v":{"$error":"#DIV/0!"}},{"$f":"AO41/AU42-1","v":{"$error":"#DIV/0!"}},{"$f":"IF(AX41>=85%,\"Pass\",IF(AX41<85%,\"Fail\",\"Error\"))","v":{"$error":"#DIV/0!"}}]
[null,null,null,null,null,"Kg",null,null,null,null,{"$f":"J41-K41","v":{"$error":"#DIV/0!"}},null,{"$f":"IF(L41=\"Pass\",G41,\"Enter New Value\")","v":{"$error":"#DIV/0!"}},{"$f":"IF(D41=\"\",\"Ignore\",H41)","v":"Ignore"},null,null,null,null,null,null,null,null,"Joule",null,null,null,null,{"$f":"AA41-AB41","v":{"$error":"#DIV/0!"}},null,{"$f":"IF(AC41=\"Pass\",X41,\"Enter New Value\")","v":{"$error":"#DIV/0!"}},{"$f":"IF(U41=\"\",\"Ignore\",Y41)","v":"Ignore"},null,null,null,null,null,null,null,null,"Joule",null,null,null,null,{"$f":"AR41-AS41","v":{"$error":"#DIV/0!"}},null,{"$f":"IF(AT41=\"Pass\",AO41,\"Enter New Value\")","v":{"$error":"#DIV/0!"}},{"$f":"IF(AM33=\"\",\"Ignore\",Y33)","v":"Ignore"}]
[null,null,null,null,null,"MicroFit/Biofet",null,null,{"$f":"#REF!","v":{"$error":"#REF!"}},{"$f":"#REF!","v":{"$error":"#REF!"}},0.95,null,"Injured","Uninjured",null,{"$f":"M99","v":{"$error":"#REF!"}},null,null,null,{"$f":"T41","v":"Progress 1  "},{"$f":"D33","v":"dd"},{"$f":"E33","v":"tt"},{"$f":"F33","v":"Goniometre"},{"$f":"M34","v":144},{"$f":"H33","v":150},"Current value vs benchmark",{"$f":"X43/Y43","v":0.96},{"$f":"K33","v":0.9},{"$f":"IF(AA43>=85%,\"Pass\",IF(AA43<85%,\"Fail\",\"Error\"))","v":"Pass"},{"$f":"AD41","v":"Current value"},{"$f":"AE41","v":"Benchmark"},{"$f":"Z43","v":"Current value vs benchmark"},{"$f":"AD44/AE44","v":0.96},{"$f":"AD44/X43-1","v":0},{"$f":"IF(AG43>=85%,\"Pass\",IF(AG43<85%,\"Fail\",\"Error\"))","v":"Pass"},null,"Progress 2",{"$f":"U33","v":"ww"},{"$f":"V33","v":"ww"},{"$f":"W33","v":"Biodex"},{"$f":"AD34","v":600},{"$f":"AC43","v":"Pass"},"Current value vs benchmark",{"$f":"AO43/AP43","v":{"$error":"#VALUE!"}},{"$f":"AB33","v":1},{"$f":"IF(AR43>=85%,\"Pass\",IF(AR43<85%,\"Fail\",\"Error\"))","v":{"$error":"#VALUE!"}},{"$f":"AU41","v":"Current Value"},"Benchmark","Current value vs benchmark",{"$f":"AU44/AV44","v":{"$error":"#VALUE!"}},{"$f":"AO43/AU44-1","v":{"$error":"#VALUE!"}},{"$f":"IF(AX43>=85%,\"Pass\",IF(AX43<85%,\"Fail\",\"Error\"))","v":{"$error":"#VALUE!"}}]
[null,null,null,null,null,"Joule",null,null,null,null,{"$f":"J43-K43","v":{"$error":"#REF!"}},null,null,null,null,null,null,null,null,null,null,null,{"$f":"F34","v":"Degrees"},null,null,null,null,{"$f":"AA43-AB43","v":5.9999999999999942E-2},null,{"$f":"IF(AC43=\"Pass\",X43,\"Enter New Value\")","v":144},{"$f":"IF(U43=\"\",\"Ignore\",Y43)","v":150},null,null,null,null,null,null,null,null,{"$f":"W34","v":"Nm"},null,null,null,null,{"$f":"AR43-AS43","v":{"$error":"#VALUE!"}},null,{"$f":"IF(AT43=\"Pass\",AO43,\"Enter New Value\")","v":{"$error":"#VALUE!"}},{"$f":"IF(AM33=\"\",\"Ignore\",Y33)","v":"Ignore"}]
[null,null,null,null,null,"MicroFit/Biofet",null,null,{"$f":"#REF!","v":{"$error":"#REF!"}},{"$f":"#REF!","v":{"$error":"#REF!"}},0.95,null,"Injured","Uninjured",null,{"$f":"M101","v":{"$error":"#REF!"}},null,null,null,{"$f":"T43","v":"Progress 1  "},{"$f":"D35","v":"fgd"},{"$f":"E35","v":"xcvc"},"Goniometre",{"$f":"M36","v":189},{"$f":"H35","v":200},"Current value vs benchmark",{"$f":"X45/Y45","v":0.94499999999999995},{"$f":"K35","v":0.9},{"$f":"IF(AA45>=85%,\"Pass\",IF(AA45<85%,\"Fail\",\"Error\"))","v":"Pass"},{"$f":"AD43","v":"Current value"},"Benchmark",{"$f":"Z45","v":"Current value vs benchmark"},0.94499999999999995,{"$f":"AD46/X45-1","v":0},{"$f":"IF(AG45>=85%,\"Pass\",IF(AG45<85%,\"Fail\",\"Error\"))","v":"Pass"},null,"Progress 2",{"$f":"U35","v":"fhd"},{"$f":"V35","v":"dg"},"Biodex",{"$f":"AD36","v":87},{"$f":"AC45","v":"Pass"},"Current value vs benchmark",{"$f":"AO45/AP45","v":{"$error":"#VALUE!"}},{"$f":"AB35","v":1},{"$f":"IF(AR45>=85%,\"Pass\",IF(AR45<85%,\"Fail\",\"Error\"))","v":{"$error":"#VALUE!"}},{"$f":"AU43","v":"Current Value"},"Benchmark","Current value vs benchmark",{"$f":"AU46/AV46","v":{"$error":"#VALUE!"}},{"$f":"AO45/AU46-1","v":{"$error":"#VALUE!"}},{"$f":"IF(AX45>=85%,\"Pass\",IF(AX45<85%,\"Fail\",\"Error\"))","v":{"$error":"#VALUE!"}}]
[null,null,null,null,null,"Joule",null,null,null,null,{"$f":"J45-K45","v":{"$error":"#REF!"}},null,null,null,null,null,null,null,null,null,null,null,"Degrees",null,null,null,null,{"$f":"AA45-AB45","v":4.4999999999999929E-2},null,{"$f":"IF(AC45=\"Pass\",X45,\"Enter New Value\")","v":189},{"$f":"IF(U45=\"\",\"Ignore\",Y45)","v":200},null,null,null,null,null,null,null,null,"Kg",null,null,null,null,{"$f":"AR45-AS45","v":{"$error":"#VALUE!"}},null,{"$f":"IF(AT45=\"Pass\",AO45,\"Enter New Value\")","v":{"$error":"#VALUE!"}},{"$f":"IF(AM33=\"\",\"Ignore\",Y33)","v":"Ignore"}]
[null,null,null,null,null,"MicroFit/Biofet",null,null,{"$f":"#REF!","v":{"$error":"#REF!"}},{"$f":"#REF!","v":{"$error":"#REF!"}},0.95,null,"Injured","Uninjured",null,{"$f":"M103","v":{"$error":"#REF!"}},null,null,null,{"$f":"T45","v":"Progress 1  "},{"$f":"D37","v":0},{"$f":"E37","v":0},"MicroFit/Biofet",{"$f":"M38","v":{"$error":"#DIV/0!"}},{"$f":"H37","v":0},"Current value vs benchmark",{"$f":"X47/Y47","v":{"$error":"#DIV/0!"}},{"$f":"K37","v":0.9},{"$f":"IF(AA47>=85%,\"Pass\",IF(AA47<85%,\"Fail\",\"Error\"))","v":{"$error":"#DIV/0!"}},{"$f":"AD45","v":"Current value"},"Benchmark",{"$f":"Z47","v":"Current value vs benchmark"},{"$f":"AD48/AE48","v":{"$error":"#DIV/0!"}},{"$f":"AD48/X47-1","v":{"$error":"#DIV/0!"}},{"$f":"IF(AG47>=85%,\"Pass\",IF(AG47<85%,\"Fail\",\"Error\"))","v":{"$error":"#DIV/0!"}},null,"Progress 2",{"$f":"U37","v":0},{"$f":"V37","v":0},"DynoMo",{"$f":"AD38","v":{"$error":"#DIV/0!"}},{"$f":"AC47","v":{"$error":"#DIV/0!"}},"Current value vs benchmark",{"$f":"AO47/AP47","v":{"$error":"#DIV/0!"}},{"$f":"AB37","v":1},{"$f":"IF(AR47>=85%,\"Pass\",IF(AR47<85%,\"Fail\",\"Error\"))","v":{"$error":"#DIV/0!"}},{"$f":"AU45","v":"Current Value"},"Benchmark","Current value vs benchmark",{"$f":"AU48/AV48","v":{"$error":"#DIV/0!"}},{"$f":"AO47/AU48-1","v":{"$error":"#DIV/0!"}},{"$f":"IF(AX47>=85%,\"Pass\",IF(AX47<85%,\"Fail\",\"Error\"))","v":{"$error":"#DIV/0!"}}]
[null,null,null,null,null,"Joule",null,null,null,null,{"$f":"J47-K47","v":{"$error":"#REF!"}},null,null,null,null,null,null,null,null,null,null,null,"Joule",null,null,null,null,{"$f":"AA47-AB47","v":{"$error":"#DIV/0!"}},null,{"$f":"IF(AC47=\"Pass\",X47,\"Enter New Value\")","v":{"$error":"#DIV/0!"}},{"$f":"IF(U47=\"\",\"Ignore\",Y47)","v":0},null,null,null,null,null,null,null,null,"Joule",null,null,null,null,{"$f":"AR47-AS47","v":{"$error":"#DIV/0!"}},null,{"$f":"IF(AT47=\"Pass\",AO47,\"Enter New Value\")","v":{"$error":"#DIV/0!"}},{"$f":"IF(AM33=\"\",\"Ignore\",Y33)","v":"Ignore"}]
[null,null,null,null,null,"MicroFit/Biofet",null,null,{"$f":"#REF!","v":{"$error":"#REF!"}},{"$f":"#REF!","v":{"$error":"#REF!"}},0.95,null,"Injured","Uninjured",null,{"$f":"M105","v":{"$error":"#REF!"}},null,null,null,{"$f":"T47","v":"Progress 1  "},{"$f":"D39","v":0},{"$f":"E39","v":0},"Step",{"$f":"M40","v":{"$error":"#DIV/0!"}},{"$f":"H39","v":0},"Current value vs benchmark",{"$f":"X49/Y49","v":{"$error":"#DIV/0!"}},{"$f":"K39","v":1},{"$f":"IF(AA49>=85%,\"Pass\",IF(AA49<85%,\"Fail\",\"Error\"))","v":{"$error":"#DIV/0!"}},{"$f":"AD47","v":"Current value"},"Benchmark",{"$f":"Z49","v":"Current value vs benchmark"},{"$f":"AD50/AE50","v":{"$error":"#DIV/0!"}},{"$f":"AD50/X49-1","v":{"$error":"#DIV/0!"}},{"$f":"IF(AG49>=85%,\"Pass\",IF(AG49<85%,\"Fail\",\"Error\"))","v":{"$error":"#DIV/0!"}},null,"Progress 2",{"$f":"U39","v":0},{"$f":"V39","v":0},"MicroFit/Biofet",{"$f":"AD40","v":{"$error":"#DIV/0!"}},{"$f":"AC49","v":{"$error":"#DIV/0!"}},"Current value vs benchmark",{"$f":"AO49/AP49","v":{"$error":"#DIV/0!"}},{"$f":"AB39","v":1},{"$f":"IF(AR49>=85%,\"Pass\",IF(AR49<85%,\"Fail\",\"Error\"))","v":{"$error":"#DIV/0!"}},{"$f":"AU47","v":"Current Value"},"Benchmark","Current value vs benchmark",{"$f":"AU50/AV50","v":{"$error":"#DIV/0!"}},{"$f":"AO49/AU50-1","v":{"$error":"#DIV/0!"}},{"$f":"IF(AX49>=85%,\"Pass\",IF(AX49<85%,\"Fail\",\"Error\"))","v":{"$error":"#DIV/0!"}}]
[null,null,null,null,null,"Joule",null,null,null,null,{"$f":"J49-K49","v":{"$error":"#REF!"}},null,null,null,null,null,null,null,null,null,null,null,"Numeric value",null,null,null,null,{"$f":"AA49-AB49","v":{"$error":"#DIV/0!"}},null,{"$f":"IF(AC49=\"Pass\",X49,\"Enter New Value\")","v":{"$error":"#DIV/0!"}},{"$f":"IF(U49=\"\",\"Ignore\",Y49)","v":0},null,null,null,null,null,null,null,null,"Joule",null,null,null,null,{"$f":"AR49-AS49","v":{"$error":"#DIV/0!"}},null,{"$f":"IF(AT49=\"Pass\",AO49,\"Enter New Value\")","v":{"$error":"#DIV/0!"}},{"$f":"IF(AM33=\"\",\"Ignore\",Y33)","v":"Ignore"}]
[null,null,null,null,null,"MicroFit/Biofet",null,null,{"$f":"#REF!","v":{"$error":"#REF!"}},{"$f":"#REF!","v":{"$error":"#REF!"}},0.95,null,"Injured","Uninjured",null,{"$f":"M107","v":{"$error":"#REF!"}},null,null,null,{"$f":"T49","v":"Progress 1  "},{"$f":"D41","v":0},{"$f":"E41","v":0},"MicroFit/Biofet",{"$f":"M42","v":{"$error":"#DIV/0!"}},{"$f":"H41","v":0},"Current value vs benchmark",{"$f":"X51/Y51","v":{"$error":"#DIV/0!"}},{"$f":"K41","v":1},{"$f":"IF(AA51>=85%,\"Pass\",IF(AA51<85%,\"Fail\",\"Error\"))","v":{"$error":"#DIV/0!"}},{"$f":"AD49","v":"Current value"},"Benchmark",{"$f":"Z51","v":"Current value vs benchmark"},{"$f":"AD52/AE52","v":{"$error":"#DIV/0!"}},{"$f":"AD52/X51-1","v":{"$error":"#DIV/0!"}},{"$f":"IF(AG51>=85%,\"Pass\",IF(AG51<85%,\"Fail\",\"Error\"))","v":{"$error":"#DIV/0!"}},null,"Progress 2",{"$f":"U41","v":0},{"$f":"V41","v":0},"MicroFit/Biofet",{"$f":"AD42","v":{"$error":"#DIV/0!"}},{"$f":"AC51","v":{"$error":"#DIV/0!"}},"Current value vs benchmark",{"$f":"AO51/AP51","v":{"$error":"#DIV/0!"}},{"$f":"AB41","v":1},{"$f":"IF(AR51>=85%,\"Pass\",IF(AR51<85%,\"Fail\",\"Error\"))","v":{"$error":"#DIV/0!"}},{"$f":"AU49","v":"Current Value"},{"$f":"AV49","v":"Benchmark"},"Current value vs benchmark",{"$f":"AU52/AV52","v":{"$error":"#DIV/0!"}},{"$f":"AO51/AU52-1","v":{"$error":"#DIV/0!"}},{"$f":"IF(AX51>=85%,\"Pass\",IF(AX51<85%,\"Fail\",\"Error\"))","v":{"$error":"#DIV/0!"}}]
[null,null,null,null,null,"Joule",null,null,null,null,{"$f":"J51-K51","v":{"$error":"#REF!"}},null,null,null,null,null,null,null,null,null,null,null,"Kg",null,null,null,null,{"$f":"AA51-AB51","v":{"$error":"#DIV/0!"}},null,{"$f":"IF(AC51=\"Pass\",X51,\"Enter New Value\")","v":{"$error":"#DIV/0!"}},{"$f":"IF(U51=\"\",\"Ignore\",Y51)","v":0},null,null,null,null,null,null,null,null,"Joule",null,null,null,null,{"$f":"AR51-AS51","v":{"$error":"#DIV/0!"}},null,{"$f":"IF(AT51=\"Pass\",AO51,\"Enter New Value\")","v":{"$error":"#DIV/0!"}},{"$f":"IF(AM33=\"\",\"Ignore\",Y33)","v":"Ignore"}]
[null,null,null,null,"j",null,null,null,null,null,null,null,null,null,null,null,null,null,null,null,null,null,null,null,null,null,null,null,null,null,null,null,null,null,null,null,{"$f":"AK51","v":"Progress 2"},{"$f":"U43","v":"dd"},{"$f":"V43","v":"tt"},"Goniometre",{"$f":"AD44","v":144},{"$f":"Y43","v":150},"Current value vs benchmark",{"$f":"AO53/AP53","v":0.96},{"$f":"K33","v":0.9},{"$f":"IF(AR53>=85%,\"Pass\",IF(AR53<85%,\"Fail\",\"Error\"))","v":"Pass"},{"$f":"AU51","v":"Current Value"},"Benchmark","Current value vs benchmark",{"$f":"AU54/AV54","v":{"$error":"#VALUE!"}},{"$f":"AO53/AU54-1","v":0},{"$f":"IF(AX53>=85%,\"Pass\",IF(AX53<85%,\"Fail\",\"Error\"))","v":{"$error":"#VALUE!"}}]
[null,null,null,null,null,null,null,null,null,null,null,null,null,null,null,null,null,null,null,null,null,null,null,null,null,null,null,null,null,null,null,null,null,null,null,null,null,null,null,"Degrees",null,null,null,null,{"$f":"AR53-AS53","v":5.9999999999999942E-2},null,{"$f":"IF(AT53=\"Pass\",AO53,\"Enter New Value\")","v":144},{"$f":"IF(AM33=\"\",\"Ignore\",Y33)","v":"Ignore"}]
[null,null,null,null,null,null,null,null,null,null,null,null,null,null,null,null,null,null,null,null,null,null,null,null,null,null,null,null,null,null,null,null,null,null,null,null,{"$f":"AK53","v":"Progress 2"},{"$f":"U45","v":"fgd"},{"$f":"V45","v":"xcvc"},"Goniometre",{"$f":"AD46","v":189},{"$f":"Y45","v":200},"Current value vs benchmark",{"$f":"AO55/AP55","v":0.94499999999999995},{"$f":"K35","v":0.9},{"$f":"IF(AR55>=85%,\"Pass\",IF(AR55<85%,\"Fail\",\"Error\"))","v":"Pass"},{"$f":"AU53","v":"Current Value"},"Benchmark","Current value vs benchmark",{"$f":"AU56/AV56","v":{"$error":"#VALUE!"}},{"$f":"AO55/AU56-1","v":0},{"$f":"IF(AX55>=85%,\"Pass\",IF(AX55<85%,\"Fail\",\"Error\"))","v":{"$error":"#VALUE!"}}]
[null,null,null,null,null,null,null,null,null,null,null,null,null,null,null,null,null,null,null,null,null,null,null,null,null,null,null,null,null,null,null,null,null,null,null,null,null,null,null,"Degrees",null,null,null,null,{"$f":"AR55-AS55","v":4.4999999999999929E-2},null,{"$f":"IF(AT55=\"Pass\",AO55,\"Enter New Value\")","v":189},{"$f":"IF(AM33=\"\",\"Ignore\",Y33)","v":"Ignore"}]
[null,null,null,null,null,null,null,null,null,null,null,null,null,null,null,null,null,null,null,null,null,null,null,null,null,null,null,null,null,null,null,null,null,null,null,null,{"$f":"AK55","v":"Progress 2"},{"$f":"U47","v":0},{"$f":"V47","v":0},"MicroFit/Biofet",22.9,{"$f":"Y47","v":0},"Current value vs benchmark",{"$f":"AO57/AP57","v":{"$error":"#DIV/0!"}},{"$f":"K37","v":0.9},{"$f":"IF(AR57>=85%,\"Pass\",IF(AR57<85%,\"Fail\",\"Error\"))","v":{"$error":"#DIV/0!"}},{"$f":"AU55","v":"Current Value"},"Benchmark","Current value vs benchmark",{"$f":"AU58/AV58","v":{"$error":"#DIV/0!"}},{"$f":"AO57/AU58-1","v":{"$error":"#DIV/0!"}},{"$f":"IF(AX57>=85%,\"Pass\",IF(AX57<85%,\"Fail\",\"Error\"))","v":{"$error":"#DIV/0!"}}]
[null,null,null,null,null,null,null,null,null,null,null,null,null,null,null,null,null,null,null,null,null,null,null,null,null,null,null,null,null,null,null,null,null,null,null,null,null,null,null,"Joule",null,null,null,null,{"$f":"AR57-AS57","v":{"$error":"#DIV/0!"}},null,{"$f":"IF(AT57=\"Pass\",AO57,\"Enter New Value\")","v":{"$error":"#DIV/0!"}},{"$f":"IF(AM33=\"\",\"Ignore\",Y33)","v":"Ignore"}]
[null,null,null,null,null,null,null,null,null,null,null,null,null,null,null,null,null,null,null,null,null,null,null,null,null,null,null,null,null,null,null,null,null,null,null,null,{"$f":"AK57","v":"Progress 2"},{"$f":"U49","v":0},{"$f":"V49","v":0},"Step",{"$f":"AD50","v":{"$error":"#DIV/0!"}},{"$f":"Y49","v":0},"Current value vs benchmark",{"$f":"AO59/AP59","v":{"$error":"#DIV/0!"}},{"$f":"K39","v":1},{"$f":"IF(AR59>=85%,\"Pass\",IF(AR59<85%,\"Fail\",\"Error\"))","v":{"$error":"#DIV/0!"}},{"$f":"AU57","v":"Current Value"},"Benchmark","Current value vs benchmark",{"$f":"AU60/AV60","v":{"$error":"#DIV/0!"}},{"$f":"AO59/AU60-1","v":{"$error":"#DIV/0!"}},{"$f":"IF(AX59>=85%,\"Pass\",IF(AX59<85%,\"Fail\",\"Error\"))","v":{"$error":"#DIV/0!"}}]
[null,null,null,null,null,null,null,null,null,null,null,null,null,null,null,null,null,null,null,null,null,null,null,null,null,null,null,null,null,null,null,null,null,null,null,null,null,null,null,"Numeric value",null,null,null,null,{"$f":"AR59-AS59","v":{"$error":"#DIV/0!"}},null,{"$f":"IF(AT59=\"Pass\",AO59,\"Enter New Value\")","v":{"$error":"#DIV/0!"}},{"$f":"IF(AM33=\"\",\"Ignore\",Y33)","v":"Ignore"}]
[null,null,null,null,null,null,null,null,null,null,null,null,null,null,null,null,null,null,null,null,null,null,null,null,null,null,null,null,null,null,null,null,null,null,null,null,{"$f":"AK59","v":"Progress 2"},{"$f":"U51","v":0},{"$f":"V51","v":0},"MicroFit/Biofet",{"$f":"AD52","v":{"$error":"#DIV/0!"}},{"$f":"Y51","v":0},"Current value vs benchmark",{"$f":"AO61/AP61","v":{"$error":"#DIV/0!"}},{"$f":"K41","v":1},{"$f":"IF(AR61>=85%,\"Pass\",IF(AR61<85%,\"Fail\",\"Error\"))","v":{"$error":"#DIV/0!"}},{"$f":"AU59","v":"Current Value"},"Benchmark","Current value vs benchmark",{"$f":"AU62/AV62","v":{"$error":"#DIV/0!"}},{"$f":"AO61/AU62-1","v":{"$error":"#DIV/0!"}},{"$f":"IF(AX61>=85%,\"Pass\",IF(AX61<85%,\"Fail\",\"Error\"))","v":{"$error":"#DIV/0!"}}]
[null,null,null,null,null,null,null,null,null,null,null,null,null,null,null,null,null,null,null,null,null,null,null,null,null,null,null,null,null,null,null,null,null,null,null,null,null,null,null,"Kg",null,null,null,null,{"$f":"AR61-AS61","v":{"$error":"#DIV/0!"}},null,{"$f":"IF(AT61=\"Pass\",AO61,\"Enter New Value\")","v":{"$error":"#DIV/0!"}},{"$f":"IF(AM33=\"\",\"Ignore\",Y33)","v":"Ignore"}]
[]
[]
[]
[]
[]
[]
[]
[]
[]
[]
[]
[]
[]
[]
[]
[]
[]
[]
[]
[]
[]
[]
[]
[null,null,null,null,"Performance Based Outcomes Measures (PBOM)-Unilateral",null,null,null,null,null,null,null,null,null,null,null,null,null,null,null,null,null,"Performance Based Outcomes Measures (PBOM)-Unilateral"]
[null,null,null,null,"Musculoskeletal outcomes",null,"Test descriptor","Injured","Bench mark",null,"Benchmark","Comparisons","Difference","Target",null,null,null,null,null,null,null,null,"Musculoskeletal outcomes",null,"Equipment","Bench mark",null,"Benchmark",null,"Comparisons","Difference",null,"Target"]
[null,null,null,null,null,null,null,null,null,null,null,null,null," Performance Deficit",null,null,null,null,null,null,null,null,null,null,"Metric",null,null,null,null,null,null,null," Performance Deficit"]
[null,null,null,null,{"$f":"C33","v":"Initial"},{"$f":"D33","v":"dd"},{"$f":"E33","v":"tt"},{"$f":"M34","v":144},{"$f":"H33","v":150},{"$f":"IF(I89>0,I89,#REF!)","v":150},{"$f":"H33","v":150},{"$f":"IF(OR(#REF!/J89>$L$23,J89=0), \"Injured vs uninjured\", \"Injured vs benchmark\")","v":{"$error":"#REF!"}},{"$f":"IF(L89=\"Injured vs Uninjured\", H89/#REF!,H89/J89)","v":{"$error":"#REF!"}},1,null,null,null,null,null,null,null,null,{"$f":"E89","v":"Initial"},{"$f":"F89","v":"dd"},{"$f":"#REF!","v":{"$error":"#REF!"}},{"$f":"I89","v":150},null,{"$f":"K89","v":150},null,"Injured vs benchmark",{"$f":"IF(AD89=\"Injured vs Uninjured\",#REF! /#REF!,H89/Z89)","v":0.96},null,1]
[null,null,null,null,null,null,null,null,null,null,null,null,null,{"$f":"M89-N89","v":{"$error":"#REF!"}},null,null,null,null,null,null,null,null,null,null,{"$f":"#REF!","v":{"$error":"#REF!"}},null,null,null,null,null,null,null,{"$f":"AE89-AG89","v":-4.0000000000000036E-2}]
[null,null,null,null,{"$f":"E89","v":"Initial"},{"$f":"D35","v":"fgd"},{"$f":"E35","v":"xcvc"},{"$f":"M36","v":189},{"$f":"H35","v":200},{"$f":"IF(I91>0,I91,#REF!)","v":200},{"$f":"H35","v":200},{"$f":"IF(OR(#REF!/J91>$L$23,J91=0), \"Injured vs uninjured\", \"Injured vs benchmark\")","v":{"$error":"#REF!"}},{"$f":"IF(L91=\"Injured vs Uninjured\", H91/#REF!,H91/J91)","v":{"$error":"#REF!"}},0.95,null,null,null,null,null,null,null,null,{"$f":"E91","v":"Initial"},{"$f":"F91","v":"fgd"},{"$f":"#REF!","v":{"$error":"#REF!"}},{"$f":"I91","v":200},null,{"$f":"K91","v":200},null,"Injured vs uninjured",{"$f":"IF(AD91=\"Injured vs Uninjured\",#REF! /#REF!,H91/Z91)","v":{"$error":"#REF!"}},null,0.95]
[null,null,null,null,null,null,null,null,null,null,null,null,null,{"$f":"M91-N91","v":{"$error":"#REF!"}},null,null,null,null,null,null,null,null,null,null,{"$f":"#REF!","v":{"$error":"#REF!"}},null,null,null,null,null,null,null,{"$f":"AE91-AG91","v":{"$error":"#REF!"}}]
[null,null,null,null,{"$f":"E91","v":"Initial"},{"$f":"D37","v":0},{"$f":"E37","v":0},{"$f":"M38","v":{"$error":"#DIV/0!"}},{"$f":"H37","v":0},{"$f":"IF(I93>0,I93,#REF!)","v":{"$error":"#REF!"}},{"$f":"H37","v":0},{"$f":"IF(OR(#REF!/J93>$L$23,J93=0), \"Injured vs uninjured\", \"Injured vs benchmark\")","v":{"$error":"#REF!"}},{"$f":"IF(L93=\"Injured vs Uninjured\", H93/#REF!,H93/J93)","v":{"$error":"#REF!"}},0.95,null,null,null,null,null,null,null,null,{"$f":"E93","v":"Initial"},{"$f":"F93","v":0},{"$f":"#REF!","v":{"$error":"#REF!"}},{"$f":"I93","v":0},null,{"$f":"K93","v":0},null,"Injured vs uninjured",{"$f":"IF(AD93=\"Injured vs Uninjured\",#REF! /#REF!,H93/Z93)","v":{"$error":"#REF!"}},null,0.95]
[null,null,null,null,null,null,null,null,null,null,null,null,null,{"$f":"M93-N93","v":{"$error":"#REF!"}},null,null,null,null,null,null,null,null,null,null,{"$f":"#REF!","v":{"$error":"#REF!"}},null,null,null,null,null,null,null,{"$f":"AE93-AG93","v":{"$error":"#REF!"}}]
[null,null,null,null,{"$f":"E93","v":"Initial"},{"$f":"D39","v":0},{"$f":"E39","v":0},{"$f":"M40","v":{"$error":"#DIV/0!"}},{"$f":"H39","v":0},{"$f":"IF(I95>0,I95,#REF!)","v":{"$error":"#REF!"}},{"$f":"H39","v":0},{"$f":"IF(OR(#REF!/J95>$L$23,J95=0), \"Injured vs uninjured\", \"Injured vs benchmark\")","v":{"$error":"#REF!"}},{"$f":"IF(L95=\"Injured vs Uninjured\", H95/#REF!,H95/J95)","v":{"$error":"#REF!"}},0.95,null,null,null,null,null,null,null,null,{"$f":"E95","v":"Initial"},{"$f":"F95","v":0},{"$f":"#REF!","v":{"$error":"#REF!"}},{"$f":"I95","v":0},null,{"$f":"K95","v":0},null,"Injured vs uninjured",{"$f":"IF(AD95=\"Injured vs Uninjured\",#REF! /#REF!,H95/Z95)","v":{"$error":"#REF!"}},null,0.95]
[null,null,null,null,null,null,null,null,null,null,null,null,null,{"$f":"M95-N95","v":{"$error":"#REF!"}},null,null,null,null,null,null,null,null,null,null,{"$f":"#REF!","v":{"$error":"#REF!"}},null,null,null,null,null,null,null,{"$f":"AE95-AG95","v":{"$error":"#REF!"}}]
[null,null,null,null,{"$f":"E95","v":"Initial"},{"$f":"D41","v":0},{"$f":"E41","v":0},{"$f":"M42","v":{"$error":"#DIV/0!"}},{"$f":"H41","v":0},{"$f":"IF(I97>0,I97,#REF!)","v":{"$error":"#REF!"}},{"$f":"H41","v":0},{"$f":"IF(OR(#REF!/J97>$L$23,J97=0), \"Injured vs uninjured\", \"Injured vs benchmark\")","v":{"$error":"#REF!"}},{"$f":"IF(L97=\"Injured vs Uninjured\", H97/#REF!,H97/J97)","v":{"$error":"#REF!"}},0.95,null,null,null,null,null,null,null,null,{"$f":"E97","v":"Initial"},{"$f":"F97","v":0},{"$f":"#REF!","v":{"$error":"#REF!"}},{"$f":"I97","v":0},null,{"$f":"K97","v":0},null,"Injured vs uninjured",{"$f":"IF(AD97=\"Injured vs Uninjured\",#REF! /#REF!,H97/Z97)","v":{"$error":"#REF!"}},null,0.95]
[null,null,null,null,null,null,null,null,null,null,null,null,null,{"$f":"M97-N97","v":{"$error":"#REF!"}},null,null,null,null,null,null,null,null,null,null,{"$f":"#REF!","v":{"$error":"#REF!"}},null,null,null,null,null,null,null,{"$f":"AE97-AG97","v":{"$error":"#REF!"}}]
[null,null,null,null,{"$f":"E97","v":"Initial"},{"$f":"D43","v":0},{"$f":"E43","v":0},{"$f":"M44","v":0},{"$f":"H43","v":0},{"$f":"IF(I99>0,I99,#REF!)","v":{"$error":"#REF!"}},{"$f":"H43","v":0},{"$f":"IF(OR(#REF!/J99>$L$23,J99=0), \"Injured vs uninjured\", \"Injured vs benchmark\")","v":{"$error":"#REF!"}},{"$f":"IF(L99=\"Injured vs Uninjured\", H99/#REF!,H99/J99)","v":{"$error":"#REF!"}},0.95,null,null,null,null,null,null,null,null,{"$f":"E99","v":"Initial"},{"$f":"F99","v":0},{"$f":"#REF!","v":{"$error":"#REF!"}},{"$f":"I99","v":0},null,{"$f":"K99","v":0},null,"Injured vs uninjured",{"$f":"IF(AD99=\"Injured vs Uninjured\",#REF! /#REF!,H99/Z99)","v":{"$error":"#REF!"}},null,0.95]
[null,null,null,null,null,null,null,null,null,null,null,null,null,{"$f":"M99-N99","v":{"$error":"#REF!"}},null,null,null,null,null,null,null,null,null,null,{"$f":"#REF!","v":{"$error":"#REF!"}},null,null,null,null,null,null,null,{"$f":"AE99-AG99","v":{"$error":"#REF!"}}]
[null,null,null,null,{"$f":"E99","v":"Initial"},{"$f":"D45","v":0},{"$f":"E45","v":0},{"$f":"M46","v":0},{"$f":"H45","v":0},{"$f":"IF(I101>0,I101,#REF!)","v":{"$error":"#REF!"}},{"$f":"H45","v":0},{"$f":"IF(OR(#REF!/J101>$L$23,J101=0), \"Injured vs uninjured\", \"Injured vs benchmark\")","v":{"$error":"#REF!"}},{"$f":"IF(L101=\"Injured vs Uninjured\", H101/#REF!,H101/J101)","v":{"$error":"#REF!"}},0.95,null,null,null,null,null,null,null,null,{"$f":"E101","v":"Initial"},{"$f":"F101","v":0},{"$f":"#REF!","v":{"$error":"#REF!"}},{"$f":"I101","v":0},null,{"$f":"K101","v":0},null,"Injured vs uninjured",{"$f":"IF(AD101=\"Injured vs Uninjured\",#REF! /#REF!,H101/Z101)","v":{"$error":"#REF!"}},null,0.95]
[null,null,null,null,null,null,null,null,null,null,null,null,null,{"$f":"M101-N101","v":{"$error":"#REF!"}},null,null,null,null,null,null,null,null,null,null,{"$f":"#REF!","v":{"$error":"#REF!"}},null,null,null,null,null,null,null,{"$f":"AE101-AG101","v":{"$error":"#REF!"}}]
[null,null,null,null,{"$f":"E101","v":"Initial"},{"$f":"D47","v":0},{"$f":"E47","v":0},{"$f":"M48","v":0},{"$f":"H47","v":0},{"$f":"IF(I103>0,I103,#REF!)","v":{"$error":"#REF!"}},{"$f":"H47","v":0},{"$f":"IF(OR(#REF!/J103>$L$23,J103=0), \"Injured vs uninjured\", \"Injured vs benchmark\")","v":{"$error":"#REF!"}},{"$f":"IF(L103=\"Injured vs Uninjured\", H103/#REF!,H103/J103)","v":{"$error":"#REF!"}},0.95,null,null,null,null,null,null,null,null,{"$f":"E103","v":"Initial"},{"$f":"F103","v":0},{"$f":"#REF!","v":{"$error":"#REF!"}},{"$f":"I103","v":0},null,{"$f":"K103","v":0},null,"Injured vs uninjured",{"$f":"IF(AD103=\"Injured vs Uninjured\",#REF! /#REF!,H103/Z103)","v":{"$error":"#REF!"}},null,0.95]
[null,null,null,null,null,null,null,null,null,null,null,null,null,{"$f":"M103-N103","v":{"$error":"#REF!"}},null,null,null,null,null,null,null,null,null,null,{"$f":"#REF!","v":{"$error":"#REF!"}},null,null,null,null,null,null,null,{"$f":"AE103-AG103","v":{"$error":"#REF!"}}]
[null,null,null,null,{"$f":"E103","v":"Initial"},{"$f":"D49","v":0},{"$f":"E49","v":0},{"$f":"M50","v":0},{"$f":"H49","v":0},{"$f":"IF(I105>0,I105,#REF!)","v":{"$error":"#REF!"}},{"$f":"H49","v":0},{"$f":"IF(OR(#REF!/J105>$L$23,J105=0), \"Injured vs uninjured\", \"Injured vs benchmark\")","v":{"$error":"#REF!"}},{"$f":"IF(L105=\"Injured vs Uninjured\", H105/#REF!,H105/J105)","v":{"$error":"#REF!"}},0.95,null,null,null,null,null,null,null,null,{"$f":"E105","v":"Initial"},{"$f":"F105","v":0},{"$f":"#REF!","v":{"$error":"#REF!"}},{"$f":"I105","v":0},null,{"$f":"K105","v":0},null,"Injured vs uninjured",{"$f":"IF(AD105=\"Injured vs Uninjured\",#REF! /#REF!,H105/Z105)","v":{"$error":"#REF!"}},null,0.95]
[null,null,null,null,null,null,null,null,null,null,null,null,null,{"$f":"M105-N105","v":{"$error":"#REF!"}},null,null,null,null,null,null,null,null,null,null,{"$f":"#REF!","v":{"$error":"#REF!"}},null,null,null,null,null,null,null,{"$f":"AE105-AG105","v":{"$error":"#REF!"}}]
[null,null,null,null,{"$f":"E105","v":"Initial"},{"$f":"D51","v":0},{"$f":"E51","v":0},{"$f":"M52","v":0},{"$f":"H51","v":0},{"$f":"IF(I107>0,I107,#REF!)","v":{"$error":"#REF!"}},{"$f":"H51","v":0},{"$f":"IF(OR(#REF!/J107>$L$23,J107=0), \"Injured vs uninjured\", \"Injured vs benchmark\")","v":{"$error":"#REF!"}},{"$f":"IF(L107=\"Injured vs Uninjured\", H107/#REF!,H107/J107)","v":{"$error":"#REF!"}},0.95,null,null,null,null,null,null,null,null,{"$f":"E107","v":"Initial"},{"$f":"F107","v":0},{"$f":"#REF!","v":{"$error":"#REF!"}},{"$f":"I107","v":0},null,{"$f":"K107","v":0},null,"Injured vs uninjured",{"$f":"IF(AD107=\"Injured vs Uninjured\",#REF! /#REF!,H107/Z107)","v":{"$error":"#REF!"}},null,0.95]
[null,null,null,null,null,null,null,null,null,null,null,null,null,{"$f":"M107-N107","v":{"$error":"#REF!"}},null,null,null,null,null,null,null,null,null,null,{"$f":"#REF!","v":{"$error":"#REF!"}},null,null,null,null,null,null,null,{"$f":"AE107-AG107","v":{"$error":"#REF!"}}]
[]
[]
[null,null,null,null,null,null,null,null,null,null,null,null,null,null,null,null,null,null,null,null,null,null,"Musculoskeletal outcomes",null,"Equipment","Bench mark",null,"Benchmark",null,"Comparisons","Difference",null,"Target"]
[null,null,null,null,null,null,null,null,null,null,null,null,null,null,null,null,null,null,null,null,null,null,null,null,"Metric",null,null,null,null,null,null,null," Performance Deficit"]
[null,null,null,null,null,null,null,null,null,null,null,null,null,null,null,null,null,null,null,null,null,null,{"$f":"T33","v":"Progress 1  "},{"$f":"U33","v":"ww"},{"$f":"W33","v":"Biodex"},{"$f":"Y33","v":800},null,{"$f":"IF(Z113>0,Z113,#REF!)","v":800},null,{"$f":"IF(OR(#REF!/Z113>$L$23,Z113=0), \"Injured vs uninjured\", \"Injured vs benchmark\")","v":{"$error":"#REF!"}},{"$f":"IF(AD113=\"Injured vs Uninjured\",#REF!/ Z113,#REF!/AB113)","v":{"$error":"#REF!"}},null,1]
[null,null,null,null,null,null,null,null,null,null,null,null,null,null,null,null,null,null,null,null,null,null,null,null,{"$f":"W34","v":"Nm"},null,null,null,null,null,null,null,{"$f":"AE113-AG113","v":{"$error":"#REF!"}}]
[null,null,null,null,null,null,null,null,null,null,null,null,null,null,null,null,null,null,null,null,null,null,{"$f":"T35","v":"Progress 1  "},{"$f":"U35","v":"fhd"},"Biodex",{"$f":"Y35","v":100},null,{"$f":"IF(Z115>0,Z115,#REF!)","v":100},null,{"$f":"IF(OR(#REF!/Z115>$L$23,Z115=0), \"Injured vs uninjured\", \"Injured vs benchmark\")","v":{"$error":"#REF!"}},{"$f":"IF(AD115=\"Injured vs Uninjured\",#REF!/ Z115,#REF!/AB115)","v":{"$error":"#REF!"}},null,0.95]
[null,null,null,null,null,null,null,null,null,null,null,null,null,null,null,null,null,null,null,null,null,null,null,null,"Kg",null,null,null,null,null,null,null,{"$f":"AE115-AG115","v":{"$error":"#REF!"}}]
[null,null,null,null,null,null,null,null,null,null,null,null,null,null,null,null,null,null,null,null,null,null,{"$f":"T37","v":"Progress 1  "},{"$f":"U37","v":0},"DynoMo",{"$f":"Y37","v":0},null,{"$f":"IF(Z117>0,Z117,#REF!)","v":{"$error":"#REF!"}},null,{"$f":"IF(OR(#REF!/Z117>$L$23,Z117=0), \"Injured vs uninjured\", \"Injured vs benchmark\")","v":{"$error":"#REF!"}},{"$f":"IF(AD117=\"Injured vs Uninjured\",#REF!/ Z117,#REF!/AB117)","v":{"$error":"#REF!"}},null,0.95]
[null,null,null,null,null,null,null,null,null,null,null,null,null,null,null,null,null,null,null,null,null,null,null,null,"Joule",null,null,null,null,null,null,null,{"$f":"AE117-AG117","v":{"$error":"#REF!"}}]
[null,null,null,null,null,null,null,null,null,null,null,null,null,null,null,null,null,null,null,null,null,null,{"$f":"T39","v":"Progress 1  "},{"$f":"U39","v":0},"MicroFit/Biofet",{"$f":"Y39","v":0},null,{"$f":"IF(Z119>0,Z119,#REF!)","v":{"$error":"#REF!"}},null,{"$f":"IF(OR(#REF!/Z119>$L$23,Z119=0), \"Injured vs uninjured\", \"Injured vs benchmark\")","v":{"$error":"#REF!"}},{"$f":"IF(AD119=\"Injured vs Uninjured\",#REF!/ Z119,#REF!/AB119)","v":{"$error":"#REF!"}},null,0.95]
[null,null,null,null,null,null,null,null,null,null,null,null,null,null,null,null,null,null,null,null,null,null,null,null,"Joule",null,null,null,null,null,null,null,{"$f":"AE119-AG119","v":{"$error":"#REF!"}}]
[null,null,null,null,null,null,null,null,null,null,null,null,null,null,null,null,null,null,null,null,null,null,{"$f":"T41","v":"Progress 1  "},{"$f":"U41","v":0},"MicroFit/Biofet",{"$f":"Y41","v":0},null,{"$f":"IF(Z121>0,Z121,#REF!)","v":{"$error":"#REF!"}},null,{"$f":"IF(OR(#REF!/Z121>$L$23,Z121=0), \"Injured vs uninjured\", \"Injured vs benchmark\")","v":{"$error":"#REF!"}},{"$f":"IF(AD121=\"Injured vs Uninjured\",#REF!/ Z121,#REF!/AB121)","v":{"$error":"#REF!"}},null,0.95]
[null,null,null,null,null,null,null,null,null,null,null,null,null,null,null,null,null,null,null,null,null,null,null,null,"Joule",null,null,null,null,null,null,null,{"$f":"AE121-AG121","v":{"$error":"#REF!"}}]
[null,null,null,null,null,null,null,null,null,null,null,null,null,null,null,null,null,null,null,null,null,null,{"$f":"T43","v":"Progress 1  "},{"$f":"U43","v":"dd"},"Goniometre",{"$f":"Y43","v":150},null,{"$f":"IF(Z123>0,Z123,#REF!)","v":150},null,{"$f":"IF(OR(#REF!/Z123>$L$23,Z123=0), \"Injured vs uninjured\", \"Injured vs benchmark\")","v":{"$error":"#REF!"}},{"$f":"IF(AD123=\"Injured vs Uninjured\",#REF!/ Z123,#REF!/AB123)","v":{"$error":"#REF!"}},null,0.95]
[null,null,null,null,null,null,null,null,null,null,null,null,null,null,null,null,null,null,null,null,null,null,null,null,"Degrees",null,null,null,null,null,null,null,{"$f":"AE123-AG123","v":{"$error":"#REF!"}}]
[null,null,null,null,null,null,null,null,null,null,null,null,null,null,null,null,null,null,null,null,null,null,{"$f":"T45","v":"Progress 1  "},{"$f":"U45","v":"fgd"},"Goniometre",{"$f":"Y45","v":200},null,{"$f":"IF(Z125>0,Z125,#REF!)","v":200},null,{"$f":"IF(OR(#REF!/Z125>$L$23,Z125=0), \"Injured vs uninjured\", \"Injured vs benchmark\")","v":{"$error":"#REF!"}},{"$f":"IF(AD125=\"Injured vs Uninjured\",#REF!/ Z125,#REF!/AB125)","v":{"$error":"#REF!"}},null,0.95]
[null,null,null,null,null,null,null,null,null,null,null,null,null,null,null,null,null,null,null,null,null,null,null,null,"Degrees",null,null,null,null,null,null,null,{"$f":"AE125-AG125","v":{"$error":"#REF!"}}]
[null,null,null,null,null,null,null,null,null,null,null,null,null,null,null,null,null,null,null,null,null,null,{"$f":"T47","v":"Progress 1  "},{"$f":"U47","v":0},"MicroFit/Biofet",{"$f":"Y47","v":0},null,{"$f":"IF(Z127>0,Z127,#REF!)","v":{"$error":"#REF!"}},null,{"$f":"IF(OR(#REF!/Z127>$L$23,Z127=0), \"Injured vs uninjured\", \"Injured vs benchmark\")","v":{"$error":"#REF!"}},{"$f":"IF(AD127=\"Injured vs Uninjured\",#REF!/ Z127,#REF!/AB127)","v":{"$error":"#REF!"}},null,0.95]
[null,null,null,null,null,null,null,null,null,null,null,null,null,null,null,null,null,null,null,null,null,null,null,null,"Joule",null,null,null,null,null,null,null,{"$f":"AE127-AG127","v":{"$error":"#REF!"}}]
[null,null,null,null,null,null,null,null,null,null,null,null,null,null,null,null,null,null,null,null,null,null,{"$f":"T49","v":"Progress 1  "},{"$f":"U49","v":0},"Step",{"$f":"Y49","v":0},null,{"$f":"IF(Z129>0,Z129,#REF!)","v":{"$error":"#REF!"}},null,{"$f":"IF(OR(#REF!/Z129>$L$23,Z129=0), \"Injured vs uninjured\", \"Injured vs benchmark\")","v":{"$error":"#REF!"}},{"$f":"IF(AD129=\"Injured vs Uninjured\",#REF!/ Z129,#REF!/AB129)","v":{"$error":"#REF!"}},null,0.95]
[null,null,null,null,null,null,null,null,null,null,null,null,null,null,null,null,null,null,null,null,null,null,null,null,"Numeric value",null,null,null,null,null,null,null,{"$f":"AE129-AG129","v":{"$error":"#REF!"}}]
[null,null,null,null,null,null,null,null,null,null,null,null,null,null,null,null,null,null,null,null,null,null,{"$f":"T51","v":"Progress 1  "},{"$f":"U51","v":0},"MicroFit/Biofet",{"$f":"Y51","v":0},null,{"$f":"IF(Z131>0,Z131,#REF!)","v":{"$error":"#REF!"}},null,{"$f":"IF(OR(#REF!/Z131>$L$23,Z131=0), \"Injured vs uninjured\", \"Injured vs benchmark\")","v":{"$error":"#REF!"}},{"$f":"IF(AD131=\"Injured vs Uninjured\",#REF!/ Z131,#REF!/AB131)","v":{"$error":"#REF!"}},null,0.95]
[null,null,null,null,null,null,null,null,null,null,null,null,null,null,null,null,null,null,null,null,null,null,null,null,"Kg",null,null,null,null,null,null,null,{"$f":"AE131-AG131","v":{"$error":"#REF!"}}]

{"sheet":"Initial_Rep","index":4,"n_rows":55,"n_cols":12,"rows_kept":55,"cut":false,"hidden":false,"merged":[[9,5,9,8],[10,5,10,8],[12,5,12,8],[9,0,10,1],[11,0,11,1],[11,2,11,3],[12,0,12,1],[12,2,12,3],[32,0,32,8],[11,5,11,8],[29,0,29,8],[30,0,30,8],[31,0,31,8],[13,0,13,8],[51,0,51,8],[52,0,52,8],[54,0,54,8],[0,0,0,8],[5,0,5,1],[6,0,6,1],[7,0,7,1],[8,0,8,1],[6,2,6,3],[7,2,7,3],[8,2,8,3],[5,2,5,3],[5,4,5,8],[6,4,7,4],[6,5,7,8],[8,5,8,8]]}
["Initial report"]
[]
[]
[]
[null,null,null,"Translate research into private practice"]
[{"$f":"'Input Sheet'!A8","v":"Initial assesment "},null,{"$f":"'Input Sheet'!C8","v":1},null,{"$f":"'Input Sheet'!$E$8","v":" Clinical summary"}]
[{"$f":"'Input Sheet'!A9","v":"Date:"},null,{"$f":"'Input Sheet'!C9","v":44717},null,{"$f":"'Input Sheet'!E9","v":"History:"},{"$f":"'Input Sheet'!F9","v":"Jan was operated on the 12the of April, and with ACLR"}]
[{"$f":"'Input Sheet'!A10","v":"Name & Surname:"},null,{"$f":"'Input Sheet'!C10","v":"Koos"}]
[{"$f":"'Input Sheet'!A11","v":"Field"},null,{"$f":"'Input Sheet'!C11","v":"Orthopeadic"},null,{"$f":"'Input Sheet'!E11","v":"Clinical symptoms:"},{"$f":"'Input Sheet'!F11","v":"Patella femoral pain "}]
[{"$f":"'Input Sheet'!A12","v":"Diagnose: "},null,"Primary ","Secondary",{"$f":"'Input Sheet'!E12","v":"Current intervention:"},{"$f":"'Input Sheet'!F12","v":"Exercise rehabilitation"}]
[null,null,{"$f":"'Input Sheet'!C13","v":"ACLR"},{"$f":"'Input Sheet'!D13","v":"NSLBP"},{"$f":"'Input Sheet'!E13","v":"Clinician Involve:"},{"$f":"'Input Sheet'!F13","v":"Marinelle(Biokineticist)"}]
[{"$f":"'Input Sheet'!A14","v":"Months/weeks after injury"},null,{"$f":"'Input Sheet'!C14","v":"5 months"},null,{"$f":"'Input Sheet'!E14","v":"Projected plan:"},{"$f":"'Input Sheet'!F14","v":"Exercise rehabilitation"}]
[{"$f":"'Input Sheet'!A15","v":"Patient Goal"},null,{"$f":"'Input Sheet'!C15","v":"Performance"},null,{"$f":"'Input Sheet'!E15","v":"Timeframe:"},{"$f":"'Input Sheet'!F15","v":"3 months"}]
["Patient Reported Outcomes (PROM)"]
[]
[]
[]
[]
[]
[]
[]
[]
[]
[]
[]
[]
[]
[]
[]
[{"$f":"'Input Sheet'!E75","v":"Graph 1 represents the subjective results(…%) of ….......An estamted benchmark(..) were selected based on his end goals."}]
[{"$f":"'Input Sheet'!E76","v":"Graph 2 represents the subjective results(…%) of ….......An estamted benchmark(..) were selected based on his end goals."}]
[{"$f":"'Input Sheet'!E77","v":"Graph 3 represents the subjective results(…%) of ….......An estamted benchmark(..) were selected based on his end goals."}]
["Patient Reported VAS Pain "]
[]
[]
[]
[]
[]
[]
[]
[null,null,null,null,null,null,null,null,null,null,null," "]
[]
[]
[]
[]
[]
[]
[]
[]
[]
[]
[{"$f":"'Input Sheet'!G24","v":"Graph 1 indicates a 5 in patella tendon pain while running 10 minutes"}]
[{"$f":"'Input Sheet'!G25","v":"Graph 2 indicates a 4 in patella tendon pain while doing a single leg squad."}]
[]
["Patient Performance Based Outcomes "]

{"sheet":"Progress_1_Rep","index":5,"n_rows":59,"n_cols":6,"rows_kept":59,"cut":false,"hidden":false,"merged":[[0,0,0,8],[6,0,6,1],[6,2,6,3],[6,4,6,8],[7,0,7,1],[7,2,7,3],[8,0,8,1],[8,2,8,3],[7,5,7,8],[8,5,8,8],[9,0,9,1],[9,2,9,3],[9,5,9,8],[10,0,11,1],[10,5,10,8],[11,5,11,8],[14,0,14,8],[37,0,37,8],[58,0,58,8],[12,0,12,1],[12,2,12,3],[12,5,12,8],[13,0,13,1],[13,2,13,3],[13,5,13,8],[33,0,33,8],[34,0,34,8],[35,0,35,8]]}
["Progress report"]
[]
[]
[]
[]
[null,null,null,"Translate research into private practice"]
[{"$f":"'Input Sheet'!A8","v":"Initial assesment "},null,{"$f":"'Input Sheet'!C8","v":1},null,{"$f":"'Input Sheet'!$E$8","v":" Clinical summary"}]
[{"$f":"'Input Sheet'!A9","v":"Date:"},null,{"$f":"'Input Sheet'!C9","v":44717},null,{"$f":"'Input Sheet'!AD8","v":"History:"},{"$f":"'Input Sheet'!AE8","v":"Jan was operated on the 12the of April, and with ACLR"}]
[{"$f":"'Input Sheet'!A10","v":"Name & Surname:"},null,{"$f":"'Input Sheet'!C10","v":"Koos"},null,{"$f":"'Input Sheet'!AD10","v":"Current Progress"},{"$f":"'Input Sheet'!S10","v":0}]
[{"$f":"'Input Sheet'!A11","v":"Field"},null,{"$f":"'Input Sheet'!C11","v":"Orthopeadic"},null,{"$f":"'Input Sheet'!AD11","v":"Clinical symptoms:"},{"$f":"'Input Sheet'!S11","v":"Patella femoral pain "}]
[{"$f":"'Input Sheet'!A12","v":"Diagnose: "},null,"Primary ","Secondary",{"$f":"'Input Sheet'!AD12","v":"Current intervention:"},{"$f":"'Input Sheet'!S12","v":"Exercise rehabilitation"}]
[null,null,{"$f":"'Input Sheet'!C13","v":"ACLR"},{"$f":"'Input Sheet'!D13","v":"NSLBP"},{"$f":"'Input Sheet'!AD13","v":"Clinician Involve:"},{"$f":"'Input Sheet'!S13","v":"Marinelle(Biokineticist)"}]
[{"$f":"'Input Sheet'!A14","v":"Months/weeks after injury"},null,{"$f":"'Input Sheet'!C14","v":"5 months"},null,{"$f":"'Input Sheet'!AD14","v":"Primary treatment"},{"$f":"'Input Sheet'!S14","v":"Exercise rehabilitation"}]
[{"$f":"'Input Sheet'!A15","v":"Patient Goal"},null,{"$f":"'Input Sheet'!C15","v":"Performance"},null,{"$f":"'Input Sheet'!AD15","v":"Timeframe:"},{"$f":"'Input Sheet'!S15","v":"3 months"}]
["Patient Reported Outcomes (PROM)"]
[]
[]
[]
[]
[]
[]
[]
[]
[]
[]
[]
[]
[]
[]
[]
[]
[]
[]
[{"$f":"'Input Sheet'!S18","v":"Graph 1 summarizes the subjective improvement of(….%) over the exercise rehabilitation period. Currently, Mr. Potgieter achieved 66% (Benchmark 89%)"}]
[{"$f":"'Input Sheet'!S19","v":"Graph 2 summarizes the subjective improvement of(….%) over the exercise rehabilitation period. Currently, Mr. Potgieter achieved 66% (Benchmark 89%)"}]
[{"$f":"'Input Sheet'!S20","v":"Graph 3 summarizes the subjective improvement of (….%) over the exercise rehabilitation period. Currently, Mr. Potgieter achieved 66% (Benchmark 89%)"}]
[]
["Patient Reported VAS Pain "]
[]
[]
[]
[]
[]
[]
[]
[]
[]
[]
[]
[]
[]
[]
[]
[]
[]
[]
[]
[]
["Patient Performance Based Outcomes "]

{"sheet":"Progress_2_Rep ","index":6,"n_rows":56,"n_cols":6,"rows_kept":56,"cut":false,"hidden":false,"merged":[[0,0,0,8],[6,0,6,1],[6,2,6,3],[6,4,6,8],[7,0,7,1],[7,2,7,3],[7,5,7,8],[8,0,8,1],[8,2,8,3],[8,5,8,8],[9,0,9,1],[9,2,9,3],[9,5,9,8],[10,0,11,1],[10,5,10,8],[11,5,11,8],[12,0,12,1],[12,2,12,3],[12,5,12,8],[55,0,55,8],[13,0,13,1],[13,2,13,3],[13,5,13,8],[14,0,14,8],[35,0,35,8],[32,0,32,8],[33,0,33,8],[34,0,34,8]]}
["Progress 2 report"]
[]
[]
[]
[]
[null,null,null,"Translate research into private practice"]
[{"$f":"'Input Sheet'!A8","v":"Initial assesment "},null,{"$f":"'Input Sheet'!C8","v":1},null,{"$f":"'Input Sheet'!$E$8","v":" Clinical summary"}]
[{"$f":"'Input Sheet'!A9","v":"Date:"},null,{"$f":"'Input Sheet'!C9","v":44717},null,{"$f":"'Input Sheet'!AD8","v":"History:"},{"$f":"'Input Sheet'!AE8","v":"Jan was operated on the 12the of April, and with ACLR"}]
[{"$f":"'Input Sheet'!A10","v":"Name & Surname:"},null,{"$f":"'Input Sheet'!C10","v":"Koos"},null,{"$f":"'Input Sheet'!AD10","v":"Current Progress"},{"$f":"'Input Sheet'!AE9","v":0}]
[{"$f":"'Input Sheet'!A11","v":"Field"},null,{"$f":"'Input Sheet'!C11","v":"Orthopeadic"},null,{"$f":"'Input Sheet'!AD11","v":"Clinical symptoms:"},{"$f":"'Input Sheet'!AE10","v":0}]
[{"$f":"'Input Sheet'!A12","v":"Diagnose: "},null,"Primary ","Secondary",{"$f":"'Input Sheet'!AD12","v":"Current intervention:"},{"$f":"'Input Sheet'!AE11","v":"Patella femoral pain "}]
[null,null,{"$f":"'Input Sheet'!C13","v":"ACLR"},{"$f":"'Input Sheet'!D13","v":"NSLBP"},{"$f":"'Input Sheet'!AD13","v":"Clinician Involve:"},{"$f":"'Input Sheet'!AE12","v":"Exercise rehabilitation"}]
[{"$f":"'Input Sheet'!A14","v":"Months/weeks after injury"},null,{"$f":"'Input Sheet'!C14","v":"5 months"},null,{"$f":"'Input Sheet'!AD14","v":"Primary treatment"},{"$f":"'Input Sheet'!AE13","v":"Marinelle(Biokineticist)"}]
[{"$f":"'Input Sheet'!A15","v":"Patient Goal"},null,{"$f":"'Input Sheet'!C15","v":"Performance"},null,{"$f":"'Input Sheet'!AD15","v":"Timeframe:"},{"$f":"'Input Sheet'!AE14","v":"Exercise rehabilitation"}]
["Patient Reported Outcomes (PROM)"]
[]
[]
[]
[]
[]
[]
[]
[]
[]
[]
[]
[]
[]
[]
[]
[]
[]
[{"$f":"'Input Sheet'!AE18","v":"Graph 1 summarizes the subjective improvement of(….%) over the exercise rehabilitation period. Currently, Mr. Potgieter achieved 66% (Benchmark 89%)"}]
[{"$f":"'Input Sheet'!AE19","v":"Graph 2 summarizes the subjective improvement of(….%) over the exercise rehabilitation period. Currently, Mr. Potgieter achieved 66% (Benchmark 89%)"}]
[{"$f":"'Input Sheet'!AE20","v":"Graph 3 summarizes the subjective improvement of (….%) over the exercise rehabilitation period. Currently, Mr. Potgieter achieved 66% (Benchmark 89%)"}]
["Patient Reported VAS Pain "]
[]
[]
[]
[]
[]
[]
[]
[]
[]
[]
[]
[]
[]
[]
[]
[]
[]
[{"$f":"'Input Sheet'!AH24","v":"Graph 1 indicates a decline(-5) in patella tendon pain to a 2/10 while running 10 minutes."}]
[{"$f":"'Input Sheet'!AH25","v":"Graph 2 indicates a decline(-6) in patella tendon pain to a 2/10 while doing squad manoeuver"}]
["Patient Performance Based Outcomes "]

{"sheet":"Discharge_Rep","index":7,"n_rows":56,"n_cols":6,"rows_kept":56,"cut":false,"hidden":false,"merged":[[0,0,0,8],[6,0,6,1],[6,2,6,3],[6,4,6,8],[7,0,7,1],[7,2,7,3],[7,5,7,9],[8,0,8,1],[8,2,8,3],[9,0,9,1],[9,2,9,3],[8,5,8,9],[9,5,9,9],[10,0,11,1],[12,0,12,1],[12,2,12,3],[10,5,10,9],[11,5,11,9],[12,5,12,9],[13,0,13,1],[13,2,13,3],[14,0,14,8],[34,0,34,8],[55,0,55,8],[13,5,13,9]]}
["Progress 2 report"]
[]
[]
[]
[]
[null,null,null,"Translate research into private practice"]
[{"$f":"'Input Sheet'!A8","v":"Initial assesment "},null,{"$f":"'Input Sheet'!C8","v":1},null,{"$f":"'Input Sheet'!$E$8","v":" Clinical summary"}]
[{"$f":"'Input Sheet'!A9","v":"Date:"},null,{"$f":"'Input Sheet'!C9","v":44717},null,{"$f":"'Input Sheet'!AD8","v":"History:"},{"$f":"'Input Sheet'!AE8","v":"Jan was operated on the 12the of April, and with ACLR"}]
[{"$f":"'Input Sheet'!A10","v":"Name & Surname:"},null,{"$f":"'Input Sheet'!C10","v":"Koos"},null,{"$f":"'Input Sheet'!AD10","v":"Current Progress"},{"$f":"'Input Sheet'!AE9","v":0}]
[{"$f":"'Input Sheet'!A11","v":"Field"},null,{"$f":"'Input Sheet'!C11","v":"Orthopeadic"},null,{"$f":"'Input Sheet'!AD11","v":"Clinical symptoms:"},{"$f":"'Input Sheet'!AT10","v":"Patella femoral pain "}]
[{"$f":"'Input Sheet'!A12","v":"Diagnose: "},null,"Primary ","Secondary",{"$f":"'Input Sheet'!AD12","v":"Current intervention:"},{"$f":"'Input Sheet'!AT11","v":"Exercise rehabilitation"}]
[null,null,{"$f":"'Input Sheet'!C13","v":"ACLR"},{"$f":"'Input Sheet'!D13","v":"NSLBP"},{"$f":"'Input Sheet'!AD13","v":"Clinician Involve:"},{"$f":"'Input Sheet'!AT12","v":"Marinelle(Biokineticist)"}]
[{"$f":"'Input Sheet'!A14","v":"Months/weeks after injury"},null,{"$f":"'Input Sheet'!C14","v":"5 months"},null,{"$f":"'Input Sheet'!AD14","v":"Primary treatment"},{"$f":"'Input Sheet'!AT13","v":"Exercise rehabilitation"}]
[{"$f":"'Input Sheet'!A15","v":"Patient Goal"},null,{"$f":"'Input Sheet'!C15","v":"Performance"},null,{"$f":"'Input Sheet'!AD15","v":"Timeframe:"},{"$f":"'Input Sheet'!AT14","v":"3 months"}]
["Patient Reported Outcomes (PROM)"]
[]
[]
[]
[]
[]
[]
[]
[]
[]
[]
[]
[]
[]
[]
[]
[]
[]
[]
[]
["Patient Reported VAS Pain "]
[]
[]
[]
[]
[]
[]
[]
[]
[]
[]
[]
[]
[]
[]
[]
[]
[]
[]
[]
[]
["Patient Performance Based Outcomes "]

{"sheet":"Patient Initial Dashboard","index":8,"n_rows":4,"n_cols":11,"rows_kept":4,"cut":false,"hidden":true,"merged":[]}
[]
[]
[]
[null,null,null,null,null,null,null,null,null,{"$f":"#REF!","v":{"$error":"#REF!"}},{"$f":"#REF!","v":{"$error":"#REF!"}}]

{"sheet":"Reporting Initial","index":9,"n_rows":73,"n_cols":10,"rows_kept":73,"cut":false,"hidden":true,"merged":[[37,0,37,6],[72,0,72,6],[38,0,40,6],[0,0,0,6],[4,1,4,2],[4,3,4,6],[5,1,5,2],[6,1,6,2],[8,0,9,0],[5,3,11,6],[12,0,12,6],[27,0,27,6],[41,0,41,6],[7,1,7,2],[11,1,11,2],[10,1,10,2],[26,0,26,6]]}
["Initial report"]
[]
[]
[]
[{"$f":"#REF!","v":{"$error":"#REF!"}},{"$f":"#REF!","v":{"$error":"#REF!"}},null,{"$f":"#REF!","v":{"$error":"#REF!"}}]
[{"$f":"#REF!","v":{"$error":"#REF!"}},{"$f":"#REF!","v":{"$error":"#REF!"}},null,{"$f":"#REF!","v":{"$error":"#REF!"}}]
[{"$f":"#REF!","v":{"$error":"#REF!"}},{"$f":"#REF!","v":{"$error":"#REF!"}}]
[{"$f":"#REF!","v":{"$error":"#REF!"}},{"$f":"#REF!","v":{"$error":"#REF!"}}]
[{"$f":"#REF!","v":{"$error":"#REF!"}},{"$f":"#REF!","v":{"$error":"#REF!"}},{"$f":"#REF!","v":{"$error":"#REF!"}}]
[null,{"$f":"#REF!","v":{"$error":"#REF!"}},{"$f":"#REF!","v":{"$error":"#REF!"}}]
[{"$f":"#REF!","v":{"$error":"#REF!"}},{"$f":"#REF!","v":{"$error":"#REF!"}}]
[{"$f":"#REF!","v":{"$error":"#REF!"}},{"$f":"#REF!","v":{"$error":"#REF!"}}]
["Baseline chart: Patient Reported Outcomes (PROM)"]
[]
[null,null,null,null,null,null,null," "]
[]
[]
[]
[]
[]
[]
[]
[]
[]
[]
[null,null,null,null,null,null,null,null,null," "]
[{"$f":"#REF!","v":{"$error":"#REF!"}}]
["Baseline chart: Patient Reported VAS Pain "]
[]
[]
[]
[]
[]
[]
[]
[]
[]
[{"$f":"#REF!","v":{"$error":"#REF!"}}]
[{"$f":"#REF!","v":{"$error":"#REF!"}}]
[]
[]
["Baseline chart: Patient Performance Based Outcomes "]
[]
[]
[]
[]
[]
[]
[]
[]
[]
[]
[]
[]
[]
[]
[]
[]
[]
[]
[]
[]
[]
[]
[]
[]
[]
[]
[]
[]
[]
[]
["Conclusion"]

{"sheet":"Patient  Progress 1 Dashboard","index":10,"n_rows":2,"n_cols":4,"rows_kept":2,"cut":false,"hidden":true,"merged":[]}
[]
[null,null,{"$f":"#REF!","v":{"$error":"#REF!"}},{"$f":"#REF!","v":{"$error":"#REF!"}}]

{"sheet":"Dropdown","index":11,"n_rows":52,"n_cols":4,"rows_kept":52,"cut":false,"hidden":true,"merged":[[7,9,7,10],[8,7,8,8],[8,9,8,10],[7,5,7,6],[8,5,8,6],[7,7,7,8],[4,5,4,6],[6,5,6,6],[1,5,1,6],[3,5,3,6],[1,9,1,10],[3,9,3,10],[4,9,4,10],[6,7,6,8],[6,9,6,10]]}
["VISA- P (Patella tendon)",null,null,"Neck "]
["KOOS (TKR or OA)",null,null,"Neck Disability Index  "]
["Kujala(PFPS) ",null,null,"Shoulder"]
["IKDC (Knee ligament or acute injuries)",null,null,"WOSI"]
["ACL-RSI (Fear of re-injury)",null,null,"Spadi"]
[null,null,null,"Dash"]
[0,null,null,"Lower Back"]
["1",null,null,"Oswestry Disability Index"]
["2",null,null,"Hip "]
["3",null,null,"Ihot -33"]
["4",null,null,"Hagos"]
["5",null,null,"HOOS"]
["6",null,null,"VISA -H"]
["7",null,null,"Knee"]
["8",null,null,"Kujala(PFPS)"]
["9",null,null,"VISA -P (Patella Tendon)"]
["10",null,null,"IKDC"]
[null,null,null,"KOOS(OA/TKR)"]
["Oxford Scale (MMT)",null,null,"Lysholm"]
["MicroFit/Biofet","Kg",null,"Lower leg"]
["DynoMo","Nm",null,"MTSS"]
["Cybex","Joule",null,"Ankle and Foot"]
["Biodex","Percentage",null,"VISA-A"]
["Easy angle","Degrees",null,"FAAM"]
["Force Plate","Newton",null,"Foot posture index"]
["Y-Balance","Centimetre"]
["Stopwatch","Numeric value"]
["Step","Seconds"]
["Leg Press","Repetitions"]
["Bench Press","Inches"]
["Goniometre","Pounds"]
["PAP"]
["Tubing"]
["Swiss Ball and Stop watch"]
["Measuring Tape"]
[]
[]
[]
["1 month"]
["2 month"]
["3 month"]
["4 month"]
["5 month"]
["6 month"]
["7 month"]
["8 month"]
[]
["LSI"]
["Benchmark"]
[]
["Injured vs Uninjured"]
["Injured vs Benchmark"]